program: Orca
programVersion: 4.2.1
elementType: Cl Cl O N N C C C C C C C C C C C C C C H H H H H H H H H H H H H H
charge: 0
multiplicity: 1
keywords: wb97x-d3
keywords: def2-TZVPP
keywords: def2/J RIJCOSX GRIDX6 NOFINALGRIDX
keywords: grid4 nofinalgrid
keywords: scfconv7
keywords: smallprint printgap noloewdin
keywords: NOSOSCF
formula: C14H14Cl2N2O
InChI: InChI=1S/C14H14Cl2N2O/c1-2-7-19-14(9-18-6-5-17-10-18)12-4-3-11(15)8-13(12)16/h2-6,8,10,14H,1,7,9H2
33 atoms
Cl -0.363536 -0.335358 1.927783
Cl 4.180868 -1.953636 -0.321845
O  -1.427915 1.894502 0.319797
N  -2.394369 -0.71702 -0.657153
N  -3.435617 -1.877809 0.902359
C  -0.89353 1.274958 -0.816483
C  -1.983794 0.415556 -1.45047
C  0.377778 0.482954 -0.578782
C  0.682118 -0.269839 0.553379
C  1.300136 0.454946 -1.623026
C  -1.847556 -1.970965 -0.677127
C  -3.326383 -0.712646 0.318898
C  -0.608126 2.904975 0.883031
C  1.852457 -1.013376 0.640428
C  2.465014 -0.288351 -1.572998
C  2.729933 -1.019727 -0.427799
C  -2.506094 -2.671294 0.288456
C  -0.458401 4.087704 -0.020941
C  0.712812 4.538888 -0.451285
H  -0.650434 2.026789 -1.580327
H  -2.856072 1.039909 -1.645864
H  -1.631351 0.052734 -2.414951
H  1.095666 1.037291 -2.51325
H  -1.071181 -2.25147 -1.369272
H  -3.914777 0.162594 0.545476
H  -1.106511 3.199001 1.808887
H  0.380025 2.51708 1.157953
H  2.067003 -1.584218 1.533094
H  3.151232 -0.288302 -2.407928
H  -2.363553 -3.703697 0.566348
H  -1.374847 4.58827 -0.319741
H  0.78709 5.410716 -1.088329
H  1.644004 4.056826 -0.175861
elementType: Cl O N C H
totalener: -1647.09255328 hartree
nucrepener: 1718.94685227 hartree
electener: -3366.03940554 hartree
oneelecener: -5674.71589987 hartree
twoeener: 2308.67649432 hartree
cpcmener: -0.03147401 hartree
kineticenergy: 1642.61612590 hartree
xcener: -113.425494119564 hartree
chargesum: 0.0000000
charge: -0.073748 -0.087715 -0.364976 -0.035341 -0.395120 0.220780 -0.080599 0.012179 -0.035462 -0.182431 -0.141396 0.032530 0.067314 -0.094920 -0.156213 0.081491 -0.160933 -0.213273 -0.250820 0.104774 0.124726 0.129433 0.144581 0.176431 0.156477 0.112639 0.087631 0.121337 0.147588 0.163122 0.139216 0.135635 0.115066
qa: -0.0737 -0.0877 -0.3650 -0.0353 -0.3951 0.2208 -0.0806 0.0122 -0.0355 -0.1824 -0.1414 0.0325 0.0673 -0.0949 -0.1562 0.0815 -0.1609 -0.2133 -0.2508 0.1048 0.1247 0.1294 0.1446 0.1764 0.1565 0.1126 0.0876 0.1213 0.1476 0.1631 0.1392 0.1356 0.1151
va: 1.2449 1.2159 1.9563 3.2895 3.1005 3.7826 3.8694 3.3985 3.9132 3.9821 3.8912 4.0628 3.8915 4.0365 4.0017 3.8728 4.0570 3.8190 3.9172 1.0111 1.0091 0.9995 0.9996 0.9885 1.0085 0.9898 0.9982 1.0232 1.0036 1.0037 1.0041 1.0010 1.0087
dispcorr: -0.019295523 hartree
energy: -1647.111848800400
dipole: -10.90180 12.19591 1.29410 18.20872 -16.11806 2.09066 -9.50281 7.06069 -2.44212
magnitude: 3.46547 au
magnitude: 8.80853 debye
