program: Orca
programVersion: 4.2.1
elementType: Cl Cl O N N C C C C C C C C C C C C C C H H H H H H H H H H H H H H
charge: 0
multiplicity: 1
keywords: wb97x-d3
keywords: def2-TZVPP
keywords: def2/J RIJCOSX GRIDX6 NOFINALGRIDX
keywords: grid4 nofinalgrid
keywords: scfconv7
keywords: smallprint printgap noloewdin
keywords: NOSOSCF
formula: C14H14Cl2N2O
InChI: InChI=1S/C14H14Cl2N2O/c1-2-7-19-14(9-18-6-5-17-10-18)12-4-3-11(15)8-13(12)16/h2-6,8,10,14H,1,7,9H2
33 atoms
Cl 0.713898 -0.223146 -3.09342
Cl 3.63145 -2.926691 0.482449
O  -0.632916 2.13171 0.369273
N  -2.24087 -0.336118 0.207023
N  -2.73773 -0.897178 2.282634
C  -0.565808 1.231661 -0.70584
C  -1.907152 0.512016 -0.911458
C  0.527431 0.233091 -0.420806
C  1.138903 -0.498894 -1.433078
C  0.910309 -0.048952 0.887559
C  -1.927962 -1.662454 0.338287
C  -2.701074 0.075541 1.408754
C  -1.20322 3.38685 0.045476
C  2.096055 -1.467915 -1.175475
C  1.860006 -1.012477 1.178898
C  2.444856 -1.715769 0.139962
C  -2.25189 -1.990974 1.619682
C  -1.134578 4.260437 1.252134
C  -2.154469 4.981189 1.698626
H  -0.343782 1.76944 -1.637362
H  -2.706675 1.238739 -1.061716
H  -1.871217 -0.098677 -1.812127
H  0.456905 0.487737 1.708507
H  -1.525255 -2.243032 -0.474721
H  -3.022963 1.089634 1.584909
H  -0.638407 3.845475 -0.778185
H  -2.241974 3.290934 -0.292073
H  2.555572 -2.014522 -1.986674
H  2.132446 -1.209798 2.205863
H  -2.161957 -2.954825 2.094452
H  -0.170494 4.322633 1.747313
H  -2.047616 5.639538 2.55015
H  -3.129554 4.950559 1.227205
elementType: Cl O N C H
totalener: -1647.09544984 hartree
nucrepener: 1673.84055243 hartree
electener: -3320.93600227 hartree
oneelecener: -5583.99660243 hartree
twoeener: 2263.06060016 hartree
cpcmener: -0.02901300 hartree
kineticenergy: 1642.59992689 hartree
xcener: -113.420527612844 hartree
chargesum: 0.0000000
charge: -0.082544 -0.087942 -0.367084 -0.013379 -0.400078 0.220414 -0.148751 0.019849 -0.010581 -0.127453 -0.131727 0.033977 0.088883 -0.133370 -0.192496 0.108301 -0.151843 -0.215039 -0.265449 0.102208 0.136889 0.130760 0.143449 0.170759 0.155743 0.101491 0.089357 0.124506 0.148338 0.163083 0.137110 0.134020 0.118601
qa: -0.0825 -0.0879 -0.3671 -0.0134 -0.4001 0.2204 -0.1488 0.0198 -0.0106 -0.1275 -0.1317 0.0340 0.0889 -0.1334 -0.1925 0.1083 -0.1518 -0.2150 -0.2654 0.1022 0.1369 0.1308 0.1434 0.1708 0.1557 0.1015 0.0894 0.1245 0.1483 0.1631 0.1371 0.1340 0.1186
va: 1.2448 1.2153 1.9599 3.2643 3.1038 3.8575 3.8284 3.4914 3.9736 3.8833 3.9014 4.0600 3.8588 4.0701 4.0620 3.8465 4.0434 3.8508 3.9467 1.0173 1.0011 1.0127 1.0214 0.9904 1.0084 0.9924 0.9915 1.0202 1.0035 1.0031 1.0064 1.0012 1.0095
dispcorr: -0.018199847 hartree
energy: -1647.113649690263
dipole: -19.70557 19.60202 -0.10355 21.28566 -19.79159 1.49407 8.26967 -10.27550 -2.00583
magnitude: 2.50326 au
magnitude: 6.36279 debye
