program: Orca
programVersion: 4.2.1
elementType: Cl Cl O N N C C C C C C C C C C C C C C H H H H H H H H H H H H H H
charge: 0
multiplicity: 1
keywords: wb97x-d3
keywords: def2-TZVPP
keywords: def2/J RIJCOSX GRIDX6 NOFINALGRIDX
keywords: grid4 nofinalgrid
keywords: scfconv7
keywords: smallprint printgap noloewdin
keywords: NOSOSCF
formula: C14H14Cl2N2O
InChI: InChI=1S/C14H14Cl2N2O/c1-2-7-19-14(9-18-6-5-17-10-18)12-4-3-11(15)8-13(12)16/h2-6,8,10,14H,1,7,9H2
33 atoms
Cl 0.573399 0.848309 2.560998
Cl 3.735454 -2.211963 -0.451629
O  -1.091799 2.449242 0.616258
N  -2.508311 -0.864748 0.127935
N  -2.118589 -2.996578 -0.287122
C  -1.213513 1.205595 -0.02247
C  -2.323816 0.443224 0.708137
C  0.068267 0.403339 -0.082913
C  0.906082 0.167376 1.003762
C  0.411633 -0.196895 -1.290295
C  -3.092454 -1.137617 -1.078959
C  -1.919378 -2.007092 0.543323
C  -0.191364 3.348503 -0.010123
C  2.035785 -0.629248 0.900485
C  1.525318 -1.007719 -1.425351
C  2.330513 -1.213737 -0.319058
C  -2.849058 -2.458462 -1.310594
C  -0.639933 3.743918 -1.38123
C  0.07881 3.541039 -2.477662
H  -1.54553 1.345117 -1.060533
H  -2.093198 0.32265 1.765712
H  -3.256236 1.002387 0.636813
H  -0.216918 -0.027023 -2.155796
H  -3.629405 -0.392628 -1.642391
H  -1.375599 -2.065855 1.473238
H  -0.156763 4.223195 0.641984
H  0.823298 2.935191 -0.049536
H  2.670116 -0.792155 1.760514
H  1.757463 -1.46409 -2.377176
H  -3.171244 -3.048673 -2.153248
H  -1.612203 4.222291 -1.453527
H  -0.267906 3.864886 -3.450628
H  1.052717 3.065915 -2.441869
elementType: Cl O N C H
totalener: -1647.09443807 hartree
nucrepener: 1706.20818178 hartree
electener: -3353.30261986 hartree
oneelecener: -5648.89242676 hartree
twoeener: 2295.58980690 hartree
cpcmener: -0.02803692 hartree
kineticenergy: 1642.61723873 hartree
xcener: -113.423584221918 hartree
chargesum: 0.0000000
charge: -0.075661 -0.085875 -0.371427 -0.030375 -0.390305 0.171573 -0.111005 0.014681 -0.021609 -0.145724 -0.147973 0.035625 0.072665 -0.107965 -0.172517 0.100929 -0.154096 -0.206266 -0.253581 0.113180 0.133150 0.125167 0.139429 0.182752 0.157562 0.114383 0.086290 0.122312 0.149580 0.164086 0.140709 0.135502 0.114805
qa: -0.0757 -0.0859 -0.3714 -0.0304 -0.3903 0.1716 -0.1110 0.0147 -0.0216 -0.1457 -0.1480 0.0356 0.0727 -0.1080 -0.1725 0.1009 -0.1541 -0.2063 -0.2536 0.1132 0.1331 0.1252 0.1394 0.1828 0.1576 0.1144 0.0863 0.1223 0.1496 0.1641 0.1407 0.1355 0.1148
va: 1.2440 1.2172 1.9546 3.2945 3.0926 3.8002 3.8235 3.2853 3.9466 3.8792 3.9006 4.0484 3.9115 4.0637 4.0545 3.8602 4.0475 3.7966 3.9203 0.9999 1.0085 1.0127 1.0037 0.9888 1.0013 0.9898 0.9958 1.0227 1.0026 1.0020 1.0031 1.0012 1.0085
dispcorr: -0.019430753 hartree
energy: -1647.113868827502
dipole: -16.19480 15.79116 -0.40363 14.20248 -11.97594 2.22654 -12.56843 11.69952 -0.86891
magnitude: 2.42393 au
magnitude: 6.16113 debye
