program: Orca
programVersion: 4.2.1
elementType: Cl Cl O N N C C C C C C C C C C C C C C H H H H H H H H H H H H H H
charge: 0
multiplicity: 1
keywords: wb97x-d3
keywords: def2-TZVPP
keywords: def2/J RIJCOSX GRIDX6 NOFINALGRIDX
keywords: grid4 nofinalgrid
keywords: scfconv7
keywords: smallprint printgap noloewdin
keywords: NOSOSCF
formula: C14H14Cl2N2O
InChI: InChI=1S/C14H14Cl2N2O/c1-2-7-19-14(9-18-6-5-17-10-18)12-4-3-11(15)8-13(12)16/h2-6,8,10,14H,1,7,9H2
33 atoms
Cl 1.287215 0.371334 -2.6628
Cl 3.497031 -3.026278 0.826222
O  -0.685244 2.119913 0.859857
N  -2.177088 -0.319272 0.01151
N  -2.326232 -2.3205 0.931572
C  -0.427562 1.401609 -0.320233
C  -1.692029 0.717923 -0.865092
C  0.620189 0.354706 -0.027842
C  1.405213 -0.205908 -1.030253
C  0.760804 -0.167564 1.255221
C  -2.839765 -0.152936 1.19721
C  -1.87436 -1.632872 -0.08379
C  -0.960606 3.500443 0.687321
C  2.297574 -1.238255 -0.78535
C  1.637749 -1.201725 1.531619
C  2.399494 -1.729833 0.503618
C  -2.930311 -1.399217 1.742387
C  -2.325271 3.772859 0.139261
C  -2.551416 4.494875 -0.950625
H  -0.067755 2.078098 -1.105672
H  -2.477927 1.453244 -1.031081
H  -1.475442 0.269186 -1.834413
H  0.165296 0.229151 2.065229
H  -3.202423 0.803782 1.531912
H  -1.339774 -2.035333 -0.930825
H  -0.872398 3.937675 1.684358
H  -0.197477 3.971483 0.056025
H  2.895998 -1.648238 -1.586617
H  1.717643 -1.589323 2.537356
H  -3.404304 -1.678823 2.669951
H  -3.161926 3.36478 0.699703
H  -3.556527 4.695756 -1.297927
H  -1.741284 4.917976 -1.533386
elementType: Cl O N C H
totalener: -1647.09401057 hartree
nucrepener: 1687.99985102 hartree
electener: -3335.09386159 hartree
oneelecener: -5612.52302964 hartree
twoeener: 2277.42916805 hartree
cpcmener: -0.02713314 hartree
kineticenergy: 1642.60296004 hartree
xcener: -113.422772263682 hartree
chargesum: -0.0000000
charge: -0.082757 -0.087544 -0.374879 -0.007492 -0.390980 0.234968 -0.157024 0.022088 -0.013531 -0.151065 -0.139733 0.030254 0.056463 -0.130325 -0.175749 0.102858 -0.159774 -0.207373 -0.255903 0.100071 0.139381 0.137619 0.142556 0.172186 0.156554 0.099957 0.094813 0.125103 0.148781 0.166253 0.150415 0.134782 0.119029
qa: -0.0828 -0.0875 -0.3749 -0.0075 -0.3910 0.2350 -0.1570 0.0221 -0.0135 -0.1511 -0.1397 0.0303 0.0565 -0.1303 -0.1757 0.1029 -0.1598 -0.2074 -0.2559 0.1001 0.1394 0.1376 0.1426 0.1722 0.1566 0.1000 0.0948 0.1251 0.1488 0.1663 0.1504 0.1348 0.1190
va: 1.2454 1.2160 1.9470 3.2503 3.0958 3.7817 3.8181 3.5555 3.9791 3.9026 3.9109 4.0522 3.9388 4.0657 4.0542 3.8542 4.0604 3.7682 3.9407 1.0174 1.0116 1.0111 1.0237 1.0006 1.0010 0.9929 0.9979 1.0198 1.0031 1.0019 0.9953 1.0015 1.0070
dispcorr: -0.019015674 hartree
energy: -1647.113026243102
dipole: -22.17239 21.86154 -0.31085 21.19017 -18.40499 2.78518 4.29746 -5.17784 -0.88038
magnitude: 2.93750 au
magnitude: 7.46654 debye
