program: Orca
programVersion: 4.2.1
elementType: Cl Cl O N N C C C C C C C C C C C C C C H H H H H H H H H H H H H H
charge: 0
multiplicity: 1
keywords: wb97x-d3
keywords: def2-TZVPP
keywords: def2/J RIJCOSX GRIDX6 NOFINALGRIDX
keywords: grid4 nofinalgrid
keywords: scfconv7
keywords: smallprint printgap noloewdin
keywords: NOSOSCF
formula: C14H14Cl2N2O
InChI: InChI=1S/C14H14Cl2N2O/c1-2-7-19-14(9-18-6-5-17-10-18)12-4-3-11(15)8-13(12)16/h2-6,8,10,14H,1,7,9H2
33 atoms
Cl -0.549237 -1.008697 -2.153127
Cl 4.007248 -2.069566 0.423866
O  -0.780206 2.589501 0.31693
N  -2.353522 -0.668981 0.717789
N  -3.300976 -2.436415 -0.202008
C  -0.999459 1.253248 -0.05306
C  -2.029398 0.717783 0.948415
C  0.273651 0.437494 -0.001938
C  0.547223 -0.610415 -0.873466
C  1.202005 0.689732 1.005126
C  -1.674225 -1.761318 1.185853
C  -3.303617 -1.131944 -0.123565
C  -0.076545 3.342847 -0.641689
C  1.690142 -1.387626 -0.755695
C  2.35277 -0.064327 1.148278
C  2.582735 -1.103873 0.261565
C  -2.27729 -2.839251 0.611218
C  0.132363 4.738237 -0.166913
C  -0.264056 5.243016 0.993999
H  -1.434087 1.205879 -1.05964
H  -1.650947 0.824105 1.965566
H  -2.945005 1.304033 0.871971
H  1.0234 1.499302 1.700765
H  -0.85464 -1.678974 1.879913
H  -3.980602 -0.468307 -0.639154
H  0.90265 2.896368 -0.863649
H  -0.62258 3.361229 -1.595891
H  1.874701 -2.198992 -1.445486
H  3.053899 0.156136 1.940647
H  -2.031344 -3.880391 0.747088
H  0.667562 5.365314 -0.872297
H  -0.057948 6.274848 1.245267
H  -0.800415 4.665191 1.734666
elementType: Cl O N C H
totalener: -1647.09645552 hartree
nucrepener: 1687.90934990 hartree
electener: -3335.00580542 hartree
oneelecener: -5611.95936667 hartree
twoeener: 2276.95356125 hartree
cpcmener: -0.02885107 hartree
kineticenergy: 1642.59876877 hartree
xcener: -113.423014920048 hartree
chargesum: -0.0000000
charge: -0.077950 -0.086242 -0.373939 -0.044054 -0.390893 0.196192 -0.078832 -0.034685 0.035268 -0.159647 -0.140038 0.018951 0.099716 -0.125811 -0.170750 0.098978 -0.154829 -0.182659 -0.314788 0.114504 0.132536 0.121976 0.144812 0.177076 0.169843 0.097722 0.100166 0.124283 0.150048 0.163938 0.138193 0.134417 0.116497
qa: -0.0780 -0.0862 -0.3739 -0.0441 -0.3909 0.1962 -0.0788 -0.0347 0.0353 -0.1596 -0.1400 0.0190 0.0997 -0.1258 -0.1707 0.0990 -0.1548 -0.1827 -0.3148 0.1145 0.1325 0.1220 0.1448 0.1771 0.1698 0.0977 0.1002 0.1243 0.1500 0.1639 0.1382 0.1344 0.1165
va: 1.2492 1.2179 1.9577 3.3015 3.0964 3.8054 3.8330 3.3814 3.9207 3.9495 3.9022 4.0563 3.8812 4.0516 4.0405 3.8578 4.0533 3.8321 3.9475 1.0140 0.9979 1.0117 1.0189 0.9879 0.9963 0.9841 0.9924 1.0200 1.0028 1.0033 1.0007 1.0019 1.0202
dispcorr: -0.018498981 hartree
energy: -1647.114954498647
dipole: -11.18103 12.12455 0.94352 22.33159 -20.16917 2.16242 7.62186 -7.03009 0.59177
magnitude: 2.43239 au
magnitude: 6.18263 debye
