program: Orca
programVersion: 4.2.1
elementType: Cl Cl O N N C C C C C C C C C C C C C C H H H H H H H H H H H H H H
charge: 0
multiplicity: 1
keywords: wb97x-d3
keywords: def2-TZVPP
keywords: def2/J RIJCOSX GRIDX6 NOFINALGRIDX
keywords: grid4 nofinalgrid
keywords: scfconv7
keywords: smallprint printgap noloewdin
keywords: NOSOSCF
formula: C14H14Cl2N2O
InChI: InChI=1S/C14H14Cl2N2O/c1-2-7-19-14(9-18-6-5-17-10-18)12-4-3-11(15)8-13(12)16/h2-6,8,10,14H,1,7,9H2
33 atoms
Cl 0.394072 0.376226 -2.889163
Cl 3.769416 -2.484242 0.114687
O  -1.097735 1.927615 0.949184
N  -2.417423 -0.66436 0.361088
N  -2.769964 -1.698954 2.277512
C  -0.958164 1.232083 -0.266875
C  -2.228687 0.424607 -0.56547
C  0.246911 0.331169 -0.177245
C  0.910264 -0.126222 -1.311236
C  0.703622 -0.126974 1.055558
C  -1.963093 -1.945479 0.201698
C  -2.871522 -0.566556 1.630056
C  -1.601539 3.236714 0.813529
C  1.993418 -0.988162 -1.240276
C  1.778908 -0.991684 1.160196
C  2.417682 -1.41248 0.006259
C  -2.19941 -2.569206 1.389242
C  -0.568084 4.241235 0.413849
C  0.733611 4.016273 0.290112
H  -0.825979 1.934347 -1.098042
H  -3.097773 1.082764 -0.528079
H  -2.189673 0.019181 -1.575272
H  0.210873 0.192711 1.96293
H  -1.533646 -2.292964 -0.723322
H  -3.293176 0.34524 2.022585
H  -2.437957 3.276545 0.103451
H  -2.024492 3.517534 1.781969
H  2.494055 -1.316471 -2.140137
H  2.110398 -1.330507 2.131587
H  -1.991514 -3.595155 1.648915
H  -0.963004 5.234936 0.225741
H  1.407924 4.810347 -0.001587
H  1.182662 3.047552 0.471675
elementType: Cl O N C H
totalener: -1647.09559667 hartree
nucrepener: 1697.86660423 hartree
electener: -3344.96220090 hartree
oneelecener: -5632.11236882 hartree
twoeener: 2287.15016792 hartree
cpcmener: -0.02861785 hartree
kineticenergy: 1642.59848302 hartree
xcener: -113.423656371735 hartree
chargesum: -0.0000000
charge: -0.081121 -0.087552 -0.387298 -0.018497 -0.400004 0.189069 -0.131225 -0.011744 0.013703 -0.105860 -0.130868 0.032770 0.099629 -0.140578 -0.195596 0.118312 -0.154136 -0.191358 -0.292939 0.119278 0.128238 0.129801 0.140548 0.170589 0.159654 0.092246 0.107536 0.124564 0.147669 0.163816 0.135852 0.134777 0.120722
qa: -0.0811 -0.0876 -0.3873 -0.0185 -0.4000 0.1891 -0.1312 -0.0117 0.0137 -0.1059 -0.1309 0.0328 0.0996 -0.1406 -0.1956 0.1183 -0.1541 -0.1914 -0.2929 0.1193 0.1282 0.1298 0.1405 0.1706 0.1597 0.0922 0.1075 0.1246 0.1477 0.1638 0.1359 0.1348 0.1207
va: 1.2477 1.2156 1.9236 3.2678 3.1029 3.8036 3.9081 3.4485 3.9554 3.8496 3.9019 4.0520 3.9096 4.0825 4.0717 3.8380 4.0444 3.7873 3.9361 1.0026 1.0032 1.0104 1.0249 0.9903 1.0073 0.9958 0.9947 1.0201 1.0039 1.0028 1.0028 1.0036 1.0061
dispcorr: -0.019219475 hartree
energy: -1647.114816141886
dipole: -16.01427 15.56898 -0.44529 17.01867 -15.14659 1.87208 7.80793 -9.45255 -1.64462
magnitude: 2.53135 au
magnitude: 6.43418 debye
