program: Orca
programVersion: 4.2.1
elementType: Cl Cl O N N C C C C C C C C C C C C C C H H H H H H H H H H H H H H
charge: 0
multiplicity: 1
keywords: wb97x-d3
keywords: def2-TZVPP
keywords: def2/J RIJCOSX GRIDX6 NOFINALGRIDX
keywords: grid4 nofinalgrid
keywords: scfconv7
keywords: smallprint printgap noloewdin
keywords: NOSOSCF
formula: C14H14Cl2N2O
InChI: InChI=1S/C14H14Cl2N2O/c1-2-7-19-14(9-18-6-5-17-10-18)12-4-3-11(15)8-13(12)16/h2-6,8,10,14H,1,7,9H2
33 atoms
Cl -0.619223 -0.943477 -2.121116
Cl 4.015534 -1.987813 0.318887
O  -0.886274 2.538882 0.504135
N  -2.386619 -0.768481 0.789316
N  -3.31218 -2.514735 -0.19052
C  -1.085626 1.214439 0.082138
C  -2.089587 0.613433 1.073786
C  0.206997 0.428269 0.076841
C  0.491401 -0.571827 -0.846158
C  1.147937 0.661372 1.076603
C  -1.677076 -1.864903 1.199002
C  -3.342358 -1.215563 -0.055045
C  -0.250409 3.355836 -0.464687
C  1.657814 -1.319915 -0.785782
C  2.321033 -0.066289 1.164471
C  2.562308 -1.057199 0.22673
C  -2.267597 -2.930089 0.588748
C  -0.135139 4.737486 0.085003
C  0.984186 5.447925 0.059038
H  -1.535314 1.201286 -0.91879
H  -1.700811 0.687115 2.089849
H  -3.018355 1.181724 1.033027
H  0.959536 1.43374 1.81097
H  -0.84669 -1.795142 1.881957
H  -4.042888 -0.546419 -0.531361
H  0.739499 2.967241 -0.730905
H  -0.850049 3.368202 -1.384833
H  1.851354 -2.093727 -1.515369
H  3.031976 0.13671 1.953184
H  -1.999163 -3.971324 0.674612
H  -1.046071 5.173287 0.48373
H  1.016768 6.464938 0.427963
H  1.907905 5.045418 -0.338534
elementType: Cl O N C H
totalener: -1647.09656053 hartree
nucrepener: 1682.18444122 hartree
electener: -3329.28100175 hartree
oneelecener: -5600.62708467 hartree
twoeener: 2271.34608292 hartree
cpcmener: -0.02894495 hartree
kineticenergy: 1642.60453676 hartree
xcener: -113.420915617045 hartree
chargesum: -0.0000000
charge: -0.078242 -0.086071 -0.390385 -0.045309 -0.390751 0.203289 -0.077113 -0.036309 0.032563 -0.162822 -0.139825 0.018683 0.091375 -0.123201 -0.168639 0.096997 -0.154674 -0.212939 -0.265854 0.112623 0.132031 0.121858 0.143141 0.177136 0.169976 0.099217 0.104464 0.124480 0.149768 0.163804 0.138020 0.133981 0.118728
qa: -0.0782 -0.0861 -0.3904 -0.0453 -0.3908 0.2033 -0.0771 -0.0363 0.0326 -0.1628 -0.1398 0.0187 0.0914 -0.1232 -0.1686 0.0970 -0.1547 -0.2129 -0.2659 0.1126 0.1320 0.1219 0.1431 0.1771 0.1700 0.0992 0.1045 0.1245 0.1498 0.1638 0.1380 0.1340 0.1187
va: 1.2494 1.2182 1.9317 3.2989 3.0962 3.8101 3.8206 3.3833 3.9217 3.9550 3.9028 4.0568 3.8346 4.0500 4.0366 3.8611 4.0531 3.8615 3.9463 1.0149 0.9988 1.0120 1.0234 0.9880 0.9963 0.9918 0.9914 1.0198 1.0031 1.0033 1.0051 1.0015 1.0094
dispcorr: -0.018239926 hartree
energy: -1647.114800454784
dipole: -9.90262 10.72528 0.82267 22.03802 -19.77421 2.26380 7.08335 -6.34035 0.74299
magnitude: 2.52064 au
magnitude: 6.40696 debye
