program: Orca
programVersion: 4.2.1
elementType: Cl Cl O N N C C C C C C C C C C C C C C H H H H H H H H H H H H H H
charge: 0
multiplicity: 1
keywords: wb97x-d3
keywords: def2-TZVPP
keywords: def2/J RIJCOSX GRIDX6 NOFINALGRIDX
keywords: grid4 nofinalgrid
keywords: scfconv7
keywords: smallprint printgap noloewdin
keywords: NOSOSCF
formula: C14H14Cl2N2O
InChI: InChI=1S/C14H14Cl2N2O/c1-2-7-19-14(9-18-6-5-17-10-18)12-4-3-11(15)8-13(12)16/h2-6,8,10,14H,1,7,9H2
33 atoms
Cl -0.47803 -0.272303 -2.118372
Cl 4.087811 -1.681628 0.26743
O  -1.044882 2.493369 1.152866
N  -2.406962 -0.870804 0.794649
N  -3.224964 -2.430558 -0.53418
C  -1.17465 1.249876 0.507332
C  -2.179565 0.445566 1.339535
C  0.147588 0.524406 0.403653
C  0.536917 -0.197701 -0.71768
C  1.016547 0.531905 1.490919
C  -1.666556 -1.999634 1.019598
C  -3.312587 -1.18209 -0.158788
C  -0.707009 3.562061 0.281846
C  1.74406 -0.877179 -0.775899
C  2.225917 -0.13989 1.46873
C  2.579062 -0.839018 0.326034
C  -2.191999 -2.950187 0.196834
C  0.669344 3.449916 -0.293597
C  0.91351 3.379521 -1.595494
H  -1.600966 1.391277 -0.492658
H  -1.831149 0.348535 2.368321
H  -3.130963 0.976268 1.363195
H  0.747923 1.082956 2.382707
H  -0.864649 -2.032845 1.738033
H  -4.024383 -0.458889 -0.526839
H  -1.445085 3.641388 -0.525988
H  -0.787675 4.466873 0.887967
H  2.023879 -1.42433 -1.665213
H  2.881249 -0.114731 2.328007
H  -1.885534 -3.979682 0.099068
H  1.492224 3.438362 0.414571
H  1.92332 3.317797 -1.980003
H  0.114231 3.379006 -2.327452
elementType: Cl O N C H
totalener: -1647.09564251 hartree
nucrepener: 1720.50791016 hartree
electener: -3367.60355267 hartree
oneelecener: -5677.49724354 hartree
twoeener: 2309.89369087 hartree
cpcmener: -0.02891269 hartree
kineticenergy: 1642.61142593 hartree
xcener: -113.423813844627 hartree
chargesum: 0.0000000
charge: -0.083568 -0.088374 -0.394724 -0.040338 -0.390987 0.206964 -0.084520 0.034068 0.024881 -0.195286 -0.134717 0.021571 0.048629 -0.132488 -0.165381 0.104709 -0.161665 -0.162597 -0.259343 0.108860 0.132358 0.120179 0.140086 0.175788 0.168742 0.086800 0.107912 0.123892 0.148418 0.165303 0.131791 0.130955 0.112082
qa: -0.0836 -0.0884 -0.3947 -0.0403 -0.3910 0.2070 -0.0845 0.0341 0.0249 -0.1953 -0.1347 0.0216 0.0486 -0.1325 -0.1654 0.1047 -0.1617 -0.1626 -0.2593 0.1089 0.1324 0.1202 0.1401 0.1758 0.1687 0.0868 0.1079 0.1239 0.1484 0.1653 0.1318 0.1310 0.1121
va: 1.2382 1.2154 1.9335 3.3006 3.0988 3.7950 3.8440 3.3220 3.8758 3.9423 3.9014 4.0544 3.9226 4.0702 4.0296 3.8538 4.0557 3.7507 3.9184 1.0178 0.9970 1.0130 1.0242 0.9884 0.9965 0.9991 0.9906 1.0208 1.0030 1.0026 1.0037 1.0024 1.0112
dispcorr: -0.020145871 hartree
energy: -1647.115788385518
dipole: -11.20595 11.78171 0.57576 15.87393 -13.72861 2.14532 6.22639 -5.01976 1.20663
magnitude: 2.52782 au
magnitude: 6.42520 debye
