program: Orca
programVersion: 4.2.1
elementType: Cl Cl O N N C C C C C C C C C C C C C C H H H H H H H H H H H H H H
charge: 0
multiplicity: 1
keywords: wb97x-d3
keywords: def2-TZVPP
keywords: def2/J RIJCOSX GRIDX6 NOFINALGRIDX
keywords: grid4 nofinalgrid
keywords: scfconv7
keywords: smallprint printgap noloewdin
keywords: NOSOSCF
formula: C14H14Cl2N2O
InChI: InChI=1S/C14H14Cl2N2O/c1-2-7-19-14(9-18-6-5-17-10-18)12-4-3-11(15)8-13(12)16/h2-6,8,10,14H,1,7,9H2
33 atoms
Cl 0.666758 1.053575 1.943035
Cl 5.252987 -1.039587 0.19717
O  -1.170422 1.009954 -0.418828
N  -2.877484 -1.142731 0.107453
N  -4.937549 -0.355752 0.128483
C  -0.680503 -0.287603 -0.583925
C  -1.457859 -1.202295 0.360148
C  0.808977 -0.426127 -0.346412
C  1.489037 0.117745 0.740793
C  1.555599 -1.16689 -1.257404
C  -3.555746 -1.806824 -0.878491
C  -3.74699 -0.273872 0.663721
C  -0.66621 1.943015 -1.336751
C  2.852935 -0.064211 0.915321
C  2.915987 -1.373697 -1.108171
C  3.552912 -0.813028 -0.014851
C  -4.825767 -1.313703 -0.842547
C  -1.373962 3.246324 -1.20376
C  -2.351431 3.526261 -0.351757
H  -0.869181 -0.63108 -1.612741
H  -1.118555 -2.228672 0.227512
H  -1.283049 -0.932519 1.401075
H  1.054371 -1.59422 -2.116782
H  -3.090757 -2.561726 -1.490478
H  -3.463601 0.380997 1.472337
H  0.410948 2.111101 -1.19193
H  -0.774348 1.578174 -2.369507
H  3.357398 0.371524 1.76624
H  3.463909 -1.954592 -1.836284
H  -5.663012 -1.603625 -1.457392
H  -1.019265 4.011416 -1.88685
H  -2.800735 4.510446 -0.333017
H  -2.742552 2.800676 0.349391
elementType: Cl O N C H
totalener: -1647.09412424 hartree
nucrepener: 1651.78755674 hartree
electener: -3298.88168099 hartree
oneelecener: -5539.67927017 hartree
twoeener: 2240.79758918 hartree
cpcmener: -0.03149070 hartree
kineticenergy: 1642.60638747 hartree
xcener: -113.420698311411 hartree
chargesum: 0.0000000
charge: -0.076088 -0.086264 -0.327530 -0.043830 -0.410462 0.212997 -0.104423 -0.042145 -0.028631 -0.117668 -0.140314 0.048292 0.099858 -0.130973 -0.172239 0.104620 -0.162968 -0.187015 -0.312950 0.111343 0.129462 0.132362 0.145542 0.186362 0.156697 0.090490 0.097664 0.123607 0.147980 0.165479 0.136741 0.134725 0.119279
qa: -0.0761 -0.0863 -0.3275 -0.0438 -0.4105 0.2130 -0.1044 -0.0421 -0.0286 -0.1177 -0.1403 0.0483 0.0999 -0.1310 -0.1722 0.1046 -0.1630 -0.1870 -0.3130 0.1113 0.1295 0.1324 0.1455 0.1864 0.1567 0.0905 0.0977 0.1236 0.1480 0.1655 0.1367 0.1347 0.1193
va: 1.2449 1.2172 1.9856 3.3051 3.0896 3.7680 3.8296 3.4682 3.9934 3.9338 3.9050 4.0437 3.8808 4.0643 4.0172 3.8511 4.0520 3.8329 3.9496 1.0060 1.0087 1.0126 1.0007 0.9851 1.0038 0.9847 0.9930 1.0228 1.0046 1.0017 0.9999 1.0006 1.0112
dispcorr: -0.017267477 hartree
energy: -1647.111391720497
dipole: -21.68675 23.90770 2.22096 3.93960 -5.08746 -1.14787 -11.40674 10.13048 -1.27626
magnitude: 2.80697 au
magnitude: 7.13475 debye
