program: Orca
programVersion: 4.2.1
elementType: Cl Cl O N N C C C C C C C C C C C C C C H H H H H H H H H H H H H H
charge: 0
multiplicity: 1
keywords: wb97x-d3
keywords: def2-TZVPP
keywords: def2/J RIJCOSX GRIDX6 NOFINALGRIDX
keywords: grid4 nofinalgrid
keywords: scfconv7
keywords: smallprint printgap noloewdin
keywords: NOSOSCF
formula: C14H14Cl2N2O
InChI: InChI=1S/C14H14Cl2N2O/c1-2-7-19-14(9-18-6-5-17-10-18)12-4-3-11(15)8-13(12)16/h2-6,8,10,14H,1,7,9H2
33 atoms
Cl -0.199676 -0.498021 -2.102521
Cl 4.038213 -2.245148 0.639441
O  -0.558583 2.579352 0.95967
N  -2.328696 -0.584589 0.600124
N  -3.275289 -2.061098 -0.737857
C  -0.800426 1.338085 0.340892
C  -1.95213 0.704471 1.126857
C  0.426652 0.454051 0.36665
C  0.76555 -0.411348 -0.66757
C  1.241204 0.449687 1.496245
C  -1.76025 -1.794617 0.893889
C  -3.214069 -0.801366 -0.397027
C  0.232484 3.463503 0.195511
C  1.873987 -1.242685 -0.599857
C  2.3503 -0.370659 1.597771
C  2.656718 -1.21125 0.539713
C  -2.361546 -2.69058 0.062103
C  -0.513976 4.179372 -0.884485
C  -1.827655 4.176215 -1.069545
H  -1.128412 1.484298 -0.694782
H  -1.675597 0.590731 2.175634
H  -2.822172 1.360474 1.087385
H  1.006799 1.106802 2.323459
H  -1.011074 -1.911881 1.658969
H  -3.800968 -0.001741 -0.822838
H  0.647613 4.197043 0.892346
H  1.097737 2.94872 -0.241866
H  2.116134 -1.902095 -1.421477
H  2.963279 -0.351169 2.487658
H  -2.189016 -3.75357 0.005081
H  0.119259 4.757543 -1.550449
H  -2.274026 4.735756 -1.880701
H  -2.511388 3.626458 -0.433961
elementType: Cl O N C H
totalener: -1647.09583990 hartree
nucrepener: 1702.01006776 hartree
electener: -3349.10590766 hartree
oneelecener: -5640.35859385 hartree
twoeener: 2291.25268619 hartree
cpcmener: -0.02849062 hartree
kineticenergy: 1642.59753774 hartree
xcener: -113.423566719592 hartree
chargesum: -0.0000000
charge: -0.078162 -0.085714 -0.398890 -0.039496 -0.388300 0.192227 -0.076967 -0.060167 0.042709 -0.158259 -0.138464 0.023432 0.109809 -0.130988 -0.176431 0.107772 -0.154300 -0.191279 -0.298945 0.123605 0.134317 0.121605 0.143883 0.177313 0.164458 0.114466 0.093780 0.124581 0.148525 0.163416 0.136120 0.134976 0.119370
qa: -0.0782 -0.0857 -0.3989 -0.0395 -0.3883 0.1922 -0.0770 -0.0602 0.0427 -0.1583 -0.1385 0.0234 0.1098 -0.1310 -0.1764 0.1078 -0.1543 -0.1913 -0.2989 0.1236 0.1343 0.1216 0.1439 0.1773 0.1645 0.1145 0.0938 0.1246 0.1485 0.1634 0.1361 0.1350 0.1194
va: 1.2487 1.2181 1.9151 3.2931 3.0991 3.7473 3.8356 3.4449 3.9259 3.9680 3.9009 4.0573 3.8811 4.0645 4.0407 3.8480 4.0521 3.7970 3.9376 1.0021 0.9988 1.0112 1.0225 0.9881 0.9987 0.9926 0.9935 1.0202 1.0036 1.0032 1.0023 1.0039 1.0125
dispcorr: -0.019179548 hartree
energy: -1647.115019447117
dipole: -14.22633 15.34485 1.11852 19.58544 -17.60225 1.98318 5.29726 -4.01529 1.28197
magnitude: 2.61296 au
magnitude: 6.64161 debye
