program: Orca
programVersion: 4.2.1
elementType: Cl Cl O N N C C C C C C C C C C C C C C H H H H H H H H H H H H H H
charge: 0
multiplicity: 1
keywords: wb97x-d3
keywords: def2-TZVPP
keywords: def2/J RIJCOSX GRIDX6 NOFINALGRIDX
keywords: grid4 nofinalgrid
keywords: scfconv7
keywords: smallprint printgap noloewdin
keywords: NOSOSCF
formula: C14H14Cl2N2O
InChI: InChI=1S/C14H14Cl2N2O/c1-2-7-19-14(9-18-6-5-17-10-18)12-4-3-11(15)8-13(12)16/h2-6,8,10,14H,1,7,9H2
33 atoms
Cl 0.720615 -1.964597 -1.891868
Cl 5.305345 -1.061063 0.715317
O  -0.832423 1.509319 0.349568
N  -2.775113 -0.547334 0.447743
N  -4.720169 -0.441551 -0.590373
C  -0.522865 0.230017 -0.138045
C  -1.363372 -0.797833 0.624794
C  0.94539 -0.074187 0.046202
C  1.589152 -1.068265 -0.684843
C  1.700402 0.605903 0.996153
C  -3.548697 0.325704 1.162157
C  -3.519303 -0.959693 -0.601864
C  -1.487321 2.35819 -0.580688
C  2.925352 -1.382893 -0.495669
C  3.037306 0.315228 1.211375
C  3.63781 -0.68086 0.460835
C  -4.746241 0.368294 0.512637
C  -1.891348 3.605294 0.128975
C  -3.146104 4.028411 0.202692
H  -0.769668 0.157919 -1.205015
H  -1.144807 -1.809773 0.284605
H  -1.129347 -0.755269 1.688651
H  1.243402 1.38773 1.585535
H  -3.193517 0.819458 2.049779
H  -3.138243 -1.654297 -1.334748
H  -0.808735 2.598476 -1.410009
H  -2.370165 1.870828 -1.010094
H  3.396156 -2.157679 -1.084075
H  3.596389 0.862412 1.95687
H  -5.62221 0.934315 0.786193
H  -1.096124 4.188771 0.583088
H  -3.402098 4.955212 0.699198
H  -3.963464 3.468616 -0.236661
elementType: Cl O N C H
totalener: -1647.09551549 hartree
nucrepener: 1634.33726855 hartree
electener: -3281.43278404 hartree
oneelecener: -5504.59753366 hartree
twoeener: 2223.16474962 hartree
cpcmener: -0.02521710 hartree
kineticenergy: 1642.59474287 hartree
xcener: -113.417162054677 hartree
chargesum: -0.0000000
charge: -0.083837 -0.087584 -0.389936 -0.037825 -0.398407 0.201393 -0.109670 0.056063 -0.030622 -0.186003 -0.121137 0.037142 0.092556 -0.126412 -0.157785 0.092405 -0.157543 -0.221614 -0.251682 0.109039 0.134921 0.134597 0.147348 0.167160 0.156544 0.115779 0.086972 0.127005 0.148280 0.162649 0.140079 0.135231 0.114892
qa: -0.0838 -0.0876 -0.3899 -0.0378 -0.3984 0.2014 -0.1097 0.0561 -0.0306 -0.1860 -0.1211 0.0371 0.0926 -0.1264 -0.1578 0.0924 -0.1575 -0.2216 -0.2517 0.1090 0.1349 0.1346 0.1473 0.1672 0.1565 0.1158 0.0870 0.1270 0.1483 0.1626 0.1401 0.1352 0.1149
va: 1.2450 1.2160 1.9192 3.2896 3.0962 3.7894 3.7816 3.5391 4.0016 3.9904 3.9008 4.0372 3.8438 4.0426 4.0165 3.8587 4.0319 3.8448 3.9417 1.0045 1.0167 1.0079 1.0246 1.0039 1.0039 0.9932 0.9864 1.0187 1.0042 1.0044 1.0028 1.0019 1.0095
dispcorr: -0.017538951 hartree
energy: -1647.113054439627
dipole: -25.40767 26.78793 1.38025 18.00551 -17.50825 0.49725 4.74964 -4.04840 0.70124
magnitude: 1.62607 au
magnitude: 4.13314 debye
