program: Orca
programVersion: 4.2.1
elementType: Cl Cl O N N C C C C C C C C C C C C C C H H H H H H H H H H H H H H
charge: 0
multiplicity: 1
keywords: wb97x-d3
keywords: def2-TZVPP
keywords: def2/J RIJCOSX GRIDX6 NOFINALGRIDX
keywords: grid4 nofinalgrid
keywords: scfconv7
keywords: smallprint printgap noloewdin
keywords: NOSOSCF
formula: C14H14Cl2N2O
InChI: InChI=1S/C14H14Cl2N2O/c1-2-7-19-14(9-18-6-5-17-10-18)12-4-3-11(15)8-13(12)16/h2-6,8,10,14H,1,7,9H2
33 atoms
Cl 0.823063 1.517081 1.780287
Cl 3.671085 -2.56882 -0.139128
O  -1.039172 2.334894 -0.399981
N  -2.504585 -0.906695 0.333724
N  -2.184122 -3.076148 0.578223
C  -1.199665 0.957387 -0.583717
C  -2.247307 0.508638 0.441153
C  0.074198 0.148892 -0.458304
C  1.005655 0.294308 0.566841
C  0.302318 -0.863535 -1.384975
C  -3.256357 -1.521457 -0.631453
C  -1.867014 -1.884412 1.012611
C  -0.230282 2.962677 -1.361887
C  2.116009 -0.529897 0.670232
C  1.394328 -1.709958 -1.305116
C  2.29422 -1.530647 -0.269558
C  -3.053352 -2.857706 -0.455528
C  -0.057092 4.405488 -1.038953
C  -0.505048 5.029719 0.041863
H  -1.604983 0.755543 -1.586639
H  -1.91977 0.726432 1.457164
H  -3.175722 1.053005 0.269587
H  -0.401348 -0.997409 -2.197097
H  -3.867792 -0.968959 -1.325198
H  -1.197466 -1.669737 1.831124
H  0.763111 2.495233 -1.421859
H  -0.668979 2.863255 -2.366081
H  2.826258 -0.392651 1.473445
H  1.538159 -2.487237 -2.041688
H  -3.495339 -3.668735 -1.012082
H  0.503927 4.959916 -1.784133
H  -0.316184 6.085543 0.182344
H  -1.061613 4.53046 0.823268
elementType: Cl O N C H
totalener: -1647.09405331 hartree
nucrepener: 1691.91620276 hartree
electener: -3339.01025607 hartree
oneelecener: -5620.18122438 hartree
twoeener: 2281.17096831 hartree
cpcmener: -0.02928345 hartree
kineticenergy: 1642.60407136 hartree
xcener: -113.422120678939 hartree
chargesum: 0.0000000
charge: -0.074749 -0.085990 -0.352845 -0.032097 -0.390442 0.197512 -0.112707 -0.060363 -0.008277 -0.097600 -0.146585 0.033561 0.095179 -0.119418 -0.174450 0.106358 -0.152024 -0.182896 -0.310809 0.114716 0.133440 0.123879 0.141684 0.182775 0.156507 0.093944 0.101559 0.123326 0.147898 0.164652 0.137864 0.134181 0.112217
qa: -0.0747 -0.0860 -0.3528 -0.0321 -0.3904 0.1975 -0.1127 -0.0604 -0.0083 -0.0976 -0.1466 0.0336 0.0952 -0.1194 -0.1744 0.1064 -0.1520 -0.1829 -0.3108 0.1147 0.1334 0.1239 0.1417 0.1828 0.1565 0.0939 0.1016 0.1233 0.1479 0.1647 0.1379 0.1342 0.1122
va: 1.2468 1.2172 1.9701 3.2958 3.0904 3.7849 3.8392 3.3827 3.9456 3.8659 3.9015 4.0529 3.8871 4.0643 4.0469 3.8548 4.0451 3.8282 3.9469 1.0008 1.0075 1.0116 1.0022 0.9886 1.0008 0.9848 0.9934 1.0223 1.0036 1.0016 0.9999 1.0009 1.0229
dispcorr: -0.018685139 hartree
energy: -1647.112738447236
dipole: -17.47644 17.05261 -0.42384 13.93613 -12.27016 1.66597 -9.41380 7.87405 -1.53975
magnitude: 2.30780 au
magnitude: 5.86595 debye
