program: Orca
programVersion: 4.2.1
elementType: Cl Cl O N N C C C C C C C C C C C C C C H H H H H H H H H H H H H H
charge: 0
multiplicity: 1
keywords: wb97x-d3
keywords: def2-TZVPP
keywords: def2/J RIJCOSX GRIDX6 NOFINALGRIDX
keywords: grid4 nofinalgrid
keywords: scfconv7
keywords: smallprint printgap noloewdin
keywords: NOSOSCF
formula: C14H14Cl2N2O
InChI: InChI=1S/C14H14Cl2N2O/c1-2-7-19-14(9-18-6-5-17-10-18)12-4-3-11(15)8-13(12)16/h2-6,8,10,14H,1,7,9H2
33 atoms
Cl 0.511831 0.466234 2.548883
Cl 5.258509 -0.776226 0.457953
O  -1.177258 1.24747 0.163624
N  -2.841724 -1.074169 -0.241067
N  -4.563877 -1.326635 -1.597458
C  -0.65891 0.054028 -0.364215
C  -1.468531 -1.108547 0.20391
C  0.820536 -0.129028 -0.097071
C  1.426414 0.023318 1.148049
C  1.640728 -0.486907 -1.162916
C  -3.866477 -0.344903 0.295041
C  -3.309026 -1.625943 -1.382257
C  -0.703608 2.416795 -0.462684
C  2.787642 -0.172635 1.327568
C  3.001239 -0.695464 -1.016191
C  3.562383 -0.532743 0.238269
C  -4.921626 -0.521817 -0.550309
C  -1.372563 2.740426 -1.761544
C  -2.472179 2.174943 -2.242772
H  -0.785298 0.030731 -1.455731
H  -1.02693 -2.047369 -0.127747
H  -1.451546 -1.109017 1.292704
H  1.199634 -0.60222 -2.145031
H  -3.764722 0.210729 1.211536
H  -2.691769 -2.25286 -2.007771
H  -0.870572 3.238472 0.239908
H  0.382568 2.379245 -0.616654
H  3.233157 -0.046517 2.304382
H  3.608022 -0.970608 -1.867214
H  -5.916709 -0.116353 -0.457907
H  -0.888354 3.533088 -2.32379
H  -2.888621 2.492078 -3.189626
H  -3.007062 1.391866 -1.718845
elementType: Cl O N C H
totalener: -1647.09421652 hartree
nucrepener: 1658.03866989 hartree
electener: -3305.13288641 hartree
oneelecener: -5552.14049725 hartree
twoeener: 2247.00761084 hartree
cpcmener: -0.02859421 hartree
kineticenergy: 1642.60216687 hartree
xcener: -113.421624552258 hartree
chargesum: -0.0000000
charge: -0.078969 -0.085514 -0.355281 -0.029817 -0.397050 0.210971 -0.105638 -0.091272 0.003102 -0.093775 -0.140178 0.025303 0.090603 -0.147986 -0.184259 0.117689 -0.151173 -0.182617 -0.286150 0.119580 0.131477 0.135442 0.146326 0.167433 0.168474 0.109728 0.094644 0.122716 0.147480 0.163558 0.137914 0.134906 0.102330
qa: -0.0790 -0.0855 -0.3553 -0.0298 -0.3970 0.2110 -0.1056 -0.0913 0.0031 -0.0938 -0.1402 0.0253 0.0906 -0.1480 -0.1843 0.1177 -0.1512 -0.1826 -0.2861 0.1196 0.1315 0.1354 0.1463 0.1674 0.1685 0.1097 0.0946 0.1227 0.1475 0.1636 0.1379 0.1349 0.1023
va: 1.2404 1.2179 1.9427 3.2886 3.0935 3.7426 3.8177 3.5212 3.9937 3.9080 3.9069 4.0354 3.9025 4.0884 4.0363 3.8339 4.0280 3.8185 3.9454 0.9959 1.0084 1.0127 0.9990 1.0029 0.9971 0.9935 0.9931 1.0242 1.0054 1.0036 0.9977 1.0043 0.9933
dispcorr: -0.018180083 hartree
energy: -1647.112396606364
dipole: -21.77174 23.77143 1.99969 6.06641 -5.78171 0.28470 -14.32291 14.31729 -0.00562
magnitude: 2.01987 au
magnitude: 5.13409 debye
