program: Orca
programVersion: 4.2.1
elementType: Cl Cl O N N C C C C C C C C C C C C C C H H H H H H H H H H H H H H
charge: 0
multiplicity: 1
keywords: wb97x-d3
keywords: def2-TZVPP
keywords: def2/J RIJCOSX GRIDX6 NOFINALGRIDX
keywords: grid4 nofinalgrid
keywords: scfconv7
keywords: smallprint printgap noloewdin
keywords: NOSOSCF
formula: C14H14Cl2N2O
InChI: InChI=1S/C14H14Cl2N2O/c1-2-7-19-14(9-18-6-5-17-10-18)12-4-3-11(15)8-13(12)16/h2-6,8,10,14H,1,7,9H2
33 atoms
Cl 0.480027 0.332063 2.603594
Cl 5.208693 -0.629092 0.330726
O  -1.293548 1.180432 0.318815
N  -2.899789 -1.156164 -0.220456
N  -4.677433 -1.568346 -1.457147
C  -0.75455 0.045728 -0.298508
C  -1.519936 -1.175603 0.20491
C  0.737007 -0.103847 -0.079986
C  1.370411 0.001094 1.156575
C  1.541258 -0.374571 -1.183249
C  -3.921483 -0.422087 0.314312
C  -3.407324 -1.819088 -1.283602
C  -0.943059 2.408353 -0.291976
C  2.741886 -0.157532 1.291178
C  2.911163 -0.545128 -1.081509
C  3.499968 -0.431365 0.165745
C  -5.010506 -0.693891 -0.461326
C  -1.572816 2.56998 -1.639596
C  -0.891089 2.816251 -2.750765
H  -0.908133 0.091091 -1.386126
H  -1.056915 -2.077359 -0.194597
H  -1.48178 -1.245828 1.291644
H  1.079336 -0.45207 -2.160043
H  -3.79478 0.205933 1.179486
H  -2.800019 -2.478862 -1.88547
H  -1.306334 3.183926 0.386367
H  0.145785 2.52836 -0.360976
H  3.208451 -0.069708 2.262593
H  3.504111 -0.75397 -1.961044
H  -6.013118 -0.309483 -0.351794
H  -2.655269 2.480759 -1.675181
H  -1.38732 2.948463 -3.703965
H  0.190001 2.901864 -2.750851
elementType: Cl O N C H
totalener: -1647.10391961 hartree
nucrepener: 1647.62174168 hartree
electener: -3294.72566129 hartree
oneelecener: -5531.28056803 hartree
twoeener: 2236.55490674 hartree
cpcmener: -0.02423275 hartree
kineticenergy: 1642.60238754 hartree
xcener: -113.417759564104 hartree
chargesum: 0.0000000
charge: -0.076508 -0.083645 -0.342012 -0.033602 -0.401300 0.204838 -0.104239 -0.049084 0.005317 -0.114355 -0.130502 0.037716 0.073101 -0.148728 -0.180545 0.113706 -0.154797 -0.199059 -0.249074 0.099757 0.124709 0.134536 0.143208 0.166813 0.162405 0.107109 0.087669 0.122725 0.145505 0.161222 0.131698 0.133372 0.112043
qa: -0.0765 -0.0836 -0.3420 -0.0336 -0.4013 0.2048 -0.1042 -0.0491 0.0053 -0.1144 -0.1305 0.0377 0.0731 -0.1487 -0.1805 0.1137 -0.1548 -0.1991 -0.2491 0.0998 0.1247 0.1345 0.1432 0.1668 0.1624 0.1071 0.0877 0.1227 0.1455 0.1612 0.1317 0.1334 0.1120
va: 1.2422 1.2197 1.9593 3.3072 3.1016 3.7846 3.8258 3.4547 3.9922 3.9110 3.9159 4.0300 3.9078 4.0879 4.0407 3.8481 4.0485 3.8022 3.9299 1.0113 1.0096 1.0122 0.9997 1.0050 0.9968 0.9904 0.9969 1.0239 1.0058 1.0027 1.0067 1.0020 1.0097
dispcorr: -0.017381465 hartree
energy: -1647.121301073997
dipole: -20.10865 21.86916 1.76051 6.83116 -6.34468 0.48648 -14.65643 14.46755 -0.18888
magnitude: 1.83623 au
magnitude: 4.66731 debye
