program: Orca
programVersion: 4.2.1
elementType: Cl Cl O N N C C C C C C C C C C C C C C H H H H H H H H H H H H H H
charge: 0
multiplicity: 1
keywords: wb97x-d3
keywords: def2-TZVPP
keywords: def2/J RIJCOSX GRIDX6 NOFINALGRIDX
keywords: grid4 nofinalgrid
keywords: scfconv7
keywords: smallprint printgap noloewdin
keywords: NOSOSCF
formula: C14H14Cl2N2O
InChI: InChI=1S/C14H14Cl2N2O/c1-2-7-19-14(9-18-6-5-17-10-18)12-4-3-11(15)8-13(12)16/h2-6,8,10,14H,1,7,9H2
33 atoms
Cl 0.865134 -0.367232 -3.032715
Cl 3.699749 -2.772684 0.809801
O  -0.685541 2.151084 0.221248
N  -2.240109 -0.357601 0.150044
N  -2.357006 -2.085057 1.513522
C  -0.552553 1.187725 -0.7882
C  -1.868618 0.421995 -1.003121
C  0.549276 0.234343 -0.39933
C  1.223272 -0.535543 -1.342706
C  0.882391 0.037118 0.937883
C  -2.772275 0.107759 1.320869
C  -2.000437 -1.676673 0.325948
C  -1.246235 3.377089 -0.209741
C  2.194804 -1.458593 -0.989565
C  1.844706 -0.880392 1.322809
C  2.494512 -1.621861 0.351193
C  -2.841572 -0.976024 2.146241
C  -1.278313 4.311854 0.952175
C  -2.354204 4.992194 1.321454
H  -0.302413 1.669394 -1.742893
H  -2.67373 1.115996 -1.246355
H  -1.771819 -0.248341 -1.856501
H  0.379256 0.608932 1.704927
H  -3.060293 1.135848 1.461022
H  -1.572556 -2.287607 -0.455103
H  -0.628695 3.803197 -1.012993
H  -2.256024 3.247378 -0.617648
H  2.704434 -2.036641 -1.747878
H  2.078715 -1.013751 2.369867
H  -3.218765 -1.014792 3.156779
H  -0.341185 4.44853 1.481676
H  -2.324194 5.69301 2.145915
H  -3.304604 4.88311 0.813613
elementType: Cl O N C H
totalener: -1647.10502185 hartree
nucrepener: 1669.88724902 hartree
electener: -3316.99227087 hartree
oneelecener: -5576.17730849 hartree
twoeener: 2259.18503762 hartree
cpcmener: -0.02523302 hartree
kineticenergy: 1642.59963962 hartree
xcener: -113.419891107187 hartree
chargesum: -0.0000000
charge: -0.082590 -0.085164 -0.359617 -0.008675 -0.384103 0.231994 -0.161435 0.021645 -0.012618 -0.148056 -0.137648 0.032897 0.086894 -0.128707 -0.172501 0.100630 -0.149097 -0.211661 -0.256853 0.098612 0.132584 0.131950 0.140895 0.167412 0.154505 0.099577 0.086137 0.123736 0.145814 0.161316 0.135493 0.131249 0.115385
qa: -0.0826 -0.0852 -0.3596 -0.0087 -0.3841 0.2320 -0.1614 0.0216 -0.0126 -0.1481 -0.1376 0.0329 0.0869 -0.1287 -0.1725 0.1006 -0.1491 -0.2117 -0.2569 0.0986 0.1326 0.1319 0.1409 0.1674 0.1545 0.0996 0.0861 0.1237 0.1458 0.1613 0.1355 0.1312 0.1154
va: 1.2451 1.2185 1.9639 3.2557 3.1034 3.8130 3.8423 3.5024 3.9713 3.9208 3.9113 4.0458 3.8670 4.0655 4.0551 3.8664 4.0516 3.8588 3.9479 1.0184 1.0018 1.0129 1.0235 0.9986 1.0011 0.9918 0.9910 1.0203 1.0042 1.0027 1.0067 1.0022 1.0099
dispcorr: -0.017996817 hartree
energy: -1647.123018662518
dipole: -21.49263 21.06145 -0.43118 23.02215 -20.66068 2.36147 7.17802 -8.58393 -1.40591
magnitude: 2.78192 au
magnitude: 7.07107 debye
