program: Orca
programVersion: 4.2.1
elementType: Cl Cl O N N C C C C C C C C C C C C C C H H H H H H H H H H H H H H
charge: 0
multiplicity: 1
keywords: wb97x-d3
keywords: def2-TZVPP
keywords: def2/J RIJCOSX GRIDX6 NOFINALGRIDX
keywords: grid4 nofinalgrid
keywords: scfconv7
keywords: smallprint printgap noloewdin
keywords: NOSOSCF
formula: C14H14Cl2N2O
InChI: InChI=1S/C14H14Cl2N2O/c1-2-7-19-14(9-18-6-5-17-10-18)12-4-3-11(15)8-13(12)16/h2-6,8,10,14H,1,7,9H2
33 atoms
Cl 0.592611 -1.959353 -1.780694
Cl 5.218993 -0.763972 0.628802
O  -1.067651 1.490963 0.403452
N  -2.890709 -0.769041 0.534405
N  -4.810169 -1.329776 -0.392023
C  -0.697298 0.211844 -0.024916
C  -1.477136 -0.794317 0.821164
C  0.789308 -0.035078 0.123795
C  1.458804 -0.998385 -0.624713
C  1.536482 0.686231 1.049409
C  -3.807445 0.153637 0.956037
C  -3.545165 -1.631384 -0.276115
C  -0.804527 2.51644 -0.53814
C  2.816447 -1.235306 -0.482093
C  2.89446 0.473949 1.216909
C  3.523581 -0.48681 0.443218
C  -4.986242 -0.213438 0.375618
C  -1.176477 3.823969 0.07439
C  -1.979988 4.707441 -0.501364
H  -0.980931 0.069729 -1.077055
H  -1.113865 -1.803503 0.633691
H  -1.315351 -0.590078 1.880412
H  1.048197 1.440076 1.653048
H  -3.553615 0.964425 1.617248
H  -3.044461 -2.465833 -0.744916
H  0.260653 2.529857 -0.806912
H  -1.368078 2.344064 -1.463399
H  3.309586 -1.987199 -1.082848
H  3.450419 1.053189 1.941191
H  -5.948815 0.264713 0.473802
H  -0.718182 4.052435 1.032012
H  -2.191896 5.663166 -0.039158
H  -2.452347 4.516442 -1.45752
elementType: Cl O N C H
totalener: -1647.10783374 hartree
nucrepener: 1622.12462333 hartree
electener: -3269.23245707 hartree
oneelecener: -5480.01541952 hartree
twoeener: 2210.78296244 hartree
cpcmener: -0.02375813 hartree
kineticenergy: 1642.59147746 hartree
xcener: -113.415341307308 hartree
chargesum: -0.0000000
charge: -0.079296 -0.084196 -0.363685 -0.034797 -0.402067 0.212833 -0.132245 0.046099 -0.041600 -0.189365 -0.127575 0.052696 0.064870 -0.124100 -0.159763 0.092742 -0.154094 -0.201673 -0.256997 0.111662 0.132303 0.138370 0.149390 0.166533 0.153942 0.111392 0.102057 0.125414 0.146513 0.161668 0.136271 0.131154 0.115544
qa: -0.0793 -0.0842 -0.3637 -0.0348 -0.4021 0.2128 -0.1322 0.0461 -0.0416 -0.1894 -0.1276 0.0527 0.0649 -0.1241 -0.1598 0.0927 -0.1541 -0.2017 -0.2570 0.1117 0.1323 0.1384 0.1494 0.1665 0.1539 0.1114 0.1021 0.1254 0.1465 0.1617 0.1363 0.1312 0.1155
va: 1.2520 1.2195 1.9487 3.2866 3.1075 3.7460 3.8103 3.4077 4.0162 3.9773 3.9195 4.0220 3.8331 4.0399 4.0226 3.8694 4.0492 3.8530 3.9523 1.0070 1.0109 1.0078 1.0200 1.0049 1.0028 0.9811 1.0047 1.0195 1.0051 1.0028 1.0028 1.0023 1.0116
dispcorr: -0.016327798 hartree
energy: -1647.124161540862
dipole: -21.60285 23.39921 1.79636 18.71395 -17.64453 1.06942 3.89854 -3.23241 0.66613
magnitude: 2.19415 au
magnitude: 5.57709 debye
