program: Orca
programVersion: 4.2.1
elementType: Cl Cl O N N C C C C C C C C C C C C C C H H H H H H H H H H H H H H
charge: 0
multiplicity: 1
keywords: wb97x-d3
keywords: def2-TZVPP
keywords: def2/J RIJCOSX GRIDX6 NOFINALGRIDX
keywords: grid4 nofinalgrid
keywords: scfconv7
keywords: smallprint printgap noloewdin
keywords: NOSOSCF
formula: C14H14Cl2N2O
InChI: InChI=1S/C14H14Cl2N2O/c1-2-7-19-14(9-18-6-5-17-10-18)12-4-3-11(15)8-13(12)16/h2-6,8,10,14H,1,7,9H2
33 atoms
Cl 0.54565 -2.079642 -1.700421
Cl 5.228084 -0.624671 0.445429
O  -1.092815 1.524884 0.244912
N  -2.882984 -0.747191 0.576733
N  -4.796052 -1.392116 -0.308532
C  -0.720381 0.221918 -0.099634
C  -1.464417 -0.723755 0.842592
C  0.774072 0.005681 0.023422
C  1.433628 -1.011603 -0.659378
C  1.539225 0.81545 0.856149
C  -3.8113 0.190752 0.935297
C  -3.527407 -1.669531 -0.173103
C  -0.891003 2.478648 -0.766814
C  2.798364 -1.219288 -0.541394
C  2.905001 0.634611 0.996642
C  3.523222 -0.383936 0.291199
C  -4.985928 -0.229933 0.383289
C  -1.23953 3.841914 -0.280057
C  -1.647562 4.161721 0.940546
H  -1.030879 -0.00146 -1.130323
H  -1.084334 -1.7392 0.735642
H  -1.291644 -0.423231 1.877144
H  1.061672 1.615308 1.406324
H  -3.568243 1.046432 1.540605
H  -3.01607 -2.526505 -0.58486
H  0.152402 2.484377 -1.115105
H  -1.502609 2.240944 -1.649742
H  3.282712 -2.014879 -1.090137
H  3.474153 1.283192 1.647761
H  -5.953343 0.24275 0.451215
H  -1.132081 4.618559 -1.030361
H  -1.874126 5.189599 1.191393
H  -1.77265 3.433922 1.73076
elementType: Cl O N C H
totalener: -1647.10812345 hartree
nucrepener: 1631.98306635 hartree
electener: -3279.09118980 hartree
oneelecener: -5499.64003816 hartree
twoeener: 2220.54884836 hartree
cpcmener: -0.02332033 hartree
kineticenergy: 1642.58842406 hartree
xcener: -113.418009749323 hartree
chargesum: -0.0000000
charge: -0.079559 -0.084397 -0.350857 -0.036207 -0.400904 0.196371 -0.128222 0.048222 -0.046712 -0.172861 -0.128326 0.053227 0.086638 -0.123819 -0.166049 0.095175 -0.156339 -0.178453 -0.300588 0.115066 0.133079 0.138118 0.148752 0.170043 0.154096 0.101612 0.102152 0.125043 0.146033 0.162377 0.133367 0.131306 0.112617
qa: -0.0796 -0.0844 -0.3509 -0.0362 -0.4009 0.1964 -0.1282 0.0482 -0.0467 -0.1729 -0.1283 0.0532 0.0866 -0.1238 -0.1660 0.0952 -0.1563 -0.1785 -0.3006 0.1151 0.1331 0.1381 0.1488 0.1700 0.1541 0.1016 0.1022 0.1250 0.1460 0.1624 0.1334 0.1313 0.1126
va: 1.2515 1.2191 1.9671 3.2872 3.1093 3.7562 3.8114 3.3998 4.0186 3.9689 3.9231 4.0208 3.8673 4.0409 4.0313 3.8635 4.0559 3.8365 3.9434 1.0059 1.0114 1.0077 1.0162 0.9958 1.0032 0.9834 0.9952 1.0198 1.0052 1.0029 1.0022 1.0033 1.0211
dispcorr: -0.016867786 hartree
energy: -1647.124991239849
dipole: -21.23308 23.01686 1.78378 18.15072 -17.09160 1.05912 5.41642 -4.94930 0.46712
magnitude: 2.12645 au
magnitude: 5.40502 debye
