program: Orca
programVersion: 4.2.1
elementType: Cl Cl O N N C C C C C C C C C C C C C C H H H H H H H H H H H H H H
charge: 0
multiplicity: 1
keywords: wb97x-d3
keywords: def2-TZVPP
keywords: def2/J RIJCOSX GRIDX6 NOFINALGRIDX
keywords: grid4 nofinalgrid
keywords: scfconv7
keywords: smallprint printgap noloewdin
keywords: NOSOSCF
formula: C14H14Cl2N2O
InChI: InChI=1S/C14H14Cl2N2O/c1-2-7-19-14(9-18-6-5-17-10-18)12-4-3-11(15)8-13(12)16/h2-6,8,10,14H,1,7,9H2
33 atoms
Cl 0.459093 0.541139 -2.842868
Cl 3.810594 -2.336827 0.174418
O  -1.344667 1.860535 0.955613
N  -2.473731 -0.775586 0.364203
N  -2.968286 -1.850061 2.223377
C  -1.072001 1.18158 -0.240562
C  -2.288793 0.314586 -0.563224
C  0.181367 0.339157 -0.147507
C  0.923137 -0.02095 -1.267366
C  0.599544 -0.167035 1.080092
C  -2.024972 -2.057547 0.204044
C  -3.024985 -0.70442 1.596734
C  -0.480412 2.951326 1.238127
C  2.038978 -0.840069 -1.186817
C  1.709266 -0.984978 1.196554
C  2.421203 -1.314652 0.055388
C  -2.344547 -2.705552 1.360179
C  -0.599164 4.054718 0.235207
C  0.421417 4.503735 -0.483748
H  -0.97341 1.892256 -1.070453
H  -3.182571 0.939522 -0.569953
H  -2.183632 -0.10018 -1.564809
H  0.045843 0.082769 1.975434
H  -1.536339 -2.388612 -0.697374
H  -3.462334 0.205343 1.977556
H  -0.782516 3.306464 2.225898
H  0.564023 2.626428 1.317806
H  2.59642 -1.098559 -2.076308
H  2.007618 -1.360872 2.165369
H  -2.15965 -3.738517 1.612063
H  -1.583742 4.49807 0.115231
H  0.30686 5.319899 -1.185734
H  1.41443 4.077762 -0.393142
elementType: Cl O N C H
totalener: -1647.10654994 hartree
nucrepener: 1691.19294246 hartree
electener: -3338.29949240 hartree
oneelecener: -5618.65705368 hartree
twoeener: 2280.35756128 hartree
cpcmener: -0.02262477 hartree
kineticenergy: 1642.59449984 hartree
xcener: -113.420510686706 hartree
chargesum: -0.0000000
charge: -0.082309 -0.085331 -0.373459 -0.028577 -0.391925 0.208512 -0.099661 0.022410 -0.024939 -0.156417 -0.133789 0.037211 0.076365 -0.135657 -0.174289 0.105819 -0.146810 -0.218540 -0.239238 0.108730 0.125551 0.123164 0.145606 0.166765 0.156116 0.110198 0.089199 0.124086 0.147191 0.161170 0.137912 0.132542 0.112398
qa: -0.0823 -0.0853 -0.3735 -0.0286 -0.3919 0.2085 -0.0997 0.0224 -0.0249 -0.1564 -0.1338 0.0372 0.0764 -0.1357 -0.1743 0.1058 -0.1468 -0.2185 -0.2392 0.1087 0.1256 0.1232 0.1456 0.1668 0.1561 0.1102 0.0892 0.1241 0.1472 0.1612 0.1379 0.1325 0.1124
va: 1.2457 1.2179 1.9589 3.2874 3.1065 3.7859 3.8693 3.3876 3.9755 3.8650 3.8986 4.0442 3.8889 4.0685 4.0703 3.8618 4.0428 3.8163 3.9202 1.0170 1.0128 1.0083 1.0172 0.9913 1.0105 0.9892 0.9954 1.0203 1.0033 1.0030 1.0045 1.0015 1.0099
dispcorr: -0.018865004 hartree
energy: -1647.125414940243
dipole: -14.23218 14.70871 0.47653 15.86141 -14.15640 1.70501 7.28402 -8.63855 -1.35453
magnitude: 2.22911 au
magnitude: 5.66594 debye
