program: Orca
programVersion: 4.2.1
elementType: Cl Cl O N N C C C C C C C C C C C C C C H H H H H H H H H H H H H H
charge: 0
multiplicity: 1
keywords: wb97x-d3
keywords: def2-TZVPP
keywords: def2/J RIJCOSX GRIDX6 NOFINALGRIDX
keywords: grid4 nofinalgrid
keywords: scfconv7
keywords: smallprint printgap noloewdin
keywords: NOSOSCF
formula: C14H14Cl2N2O
InChI: InChI=1S/C14H14Cl2N2O/c1-2-7-19-14(9-18-6-5-17-10-18)12-4-3-11(15)8-13(12)16/h2-6,8,10,14H,1,7,9H2
33 atoms
Cl 0.433526 0.372566 -2.837431
Cl 3.768295 -2.54335 0.162078
O  -1.095933 1.888546 1.026299
N  -2.402927 -0.658158 0.335015
N  -2.92313 -1.764585 2.168236
C  -0.910738 1.241914 -0.206345
C  -2.175356 0.448509 -0.56167
C  0.294304 0.336572 -0.122861
C  0.94425 -0.13758 -1.258081
C  0.76096 -0.112303 1.108964
C  -2.0055 -1.951648 0.135264
C  -2.937448 -0.599672 1.575494
C  -1.328734 3.284732 0.940591
C  2.012057 -1.018528 -1.1897
C  1.823451 -0.993338 1.211829
C  2.439814 -1.441521 0.056434
C  -2.340222 -2.619021 1.276147
C  -0.10326 4.032657 0.521377
C  -0.049181 4.819461 -0.545574
H  -0.758074 1.972134 -1.010319
H  -3.037415 1.116614 -0.538173
H  -2.10746 0.060614 -1.576891
H  0.287451 0.232737 2.016995
H  -1.540691 -2.276487 -0.781152
H  -3.333271 0.315391 1.98773
H  -2.165355 3.510717 0.267856
H  -1.632266 3.590415 1.944407
H  2.498112 -1.3638 -2.091466
H  2.161172 -1.323568 2.184349
H  -2.195964 -3.665659 1.49659
H  0.775667 3.903804 1.146696
H  0.852691 5.356813 -0.81063
H  -0.907266 4.964039 -1.192702
elementType: Cl O N C H
totalener: -1647.10445212 hartree
nucrepener: 1684.17089364 hartree
electener: -3331.27534576 hartree
oneelecener: -5604.79003935 hartree
twoeener: 2273.51469359 hartree
cpcmener: -0.02381071 hartree
kineticenergy: 1642.59615044 hartree
xcener: -113.419079361440 hartree
chargesum: 0.0000000
charge: -0.083432 -0.086440 -0.378830 -0.015963 -0.392246 0.209238 -0.144617 0.052388 -0.025859 -0.134756 -0.132692 0.037858 0.069427 -0.122485 -0.177863 0.102280 -0.149276 -0.191538 -0.253625 0.103992 0.125444 0.127783 0.140127 0.167086 0.154415 0.085764 0.100281 0.123943 0.145684 0.160796 0.134742 0.131947 0.116426
qa: -0.0834 -0.0864 -0.3788 -0.0160 -0.3922 0.2092 -0.1446 0.0524 -0.0259 -0.1348 -0.1327 0.0379 0.0694 -0.1225 -0.1779 0.1023 -0.1493 -0.1915 -0.2536 0.1040 0.1254 0.1278 0.1401 0.1671 0.1544 0.0858 0.1003 0.1239 0.1457 0.1608 0.1347 0.1319 0.1164
va: 1.2445 1.2166 1.9348 3.2677 3.1111 3.7932 3.9182 3.4925 3.9820 3.8998 3.8998 4.0525 3.9305 4.0536 4.0567 3.8577 4.0482 3.7974 3.9307 1.0149 1.0034 1.0103 1.0269 0.9916 1.0101 0.9956 0.9925 1.0197 1.0043 1.0031 1.0049 1.0027 1.0071
dispcorr: -0.018450239 hartree
energy: -1647.122902363021
dipole: -16.19645 16.21804 0.02159 18.33017 -16.32392 2.00624 6.64997 -8.11781 -1.46785
magnitude: 2.48597 au
magnitude: 6.31884 debye
