program: Orca
programVersion: 4.2.1
elementType: Cl Cl O N N C C C C C C C C C C C C C C H H H H H H H H H H H H H H
charge: 0
multiplicity: 1
keywords: wb97x-d3
keywords: def2-TZVPP
keywords: def2/J RIJCOSX GRIDX6 NOFINALGRIDX
keywords: grid4 nofinalgrid
keywords: scfconv7
keywords: smallprint printgap noloewdin
keywords: NOSOSCF
formula: C14H14Cl2N2O
InChI: InChI=1S/C14H14Cl2N2O/c1-2-7-19-14(9-18-6-5-17-10-18)12-4-3-11(15)8-13(12)16/h2-6,8,10,14H,1,7,9H2
33 atoms
Cl 0.244672 0.624697 -2.9257
Cl 3.917248 -1.992551 -0.048151
O  -1.493903 1.79973 0.923547
N  -2.534861 -0.895566 0.470108
N  -2.908349 -1.903097 2.393806
C  -1.256732 1.101347 -0.270056
C  -2.436549 0.157587 -0.511406
C  0.050481 0.342346 -0.230842
C  0.790661 0.068636 -1.374604
C  0.537952 -0.153851 0.974775
C  -2.037265 -2.163518 0.348387
C  -3.040541 -0.791064 1.71987
C  -0.993001 3.127495 0.931542
C  1.980303 -0.642967 -1.337226
C  1.716782 -0.874309 1.04722
C  2.432657 -1.107688 -0.115311
C  -2.281428 -2.770167 1.544631
C  0.50084 3.206363 0.930664
C  1.203701 3.773746 -0.040533
H  -1.250955 1.79795 -1.11805
H  -3.3609 0.736127 -0.513757
H  -2.342762 -0.298167 -1.496612
H  -0.009058 0.034299 1.888662
H  -1.571398 -2.51448 -0.557465
H  -3.502887 0.115677 2.077626
H  -1.398276 3.690565 0.081072
H  -1.391451 3.581933 1.841641
H  2.540256 -0.826079 -2.243717
H  2.069886 -1.244553 1.999683
H  -2.042029 -3.781818 1.834149
H  1.012738 2.777932 1.787223
H  2.283947 3.834429 0.002629
H  0.728287 4.207363 -0.91324
elementType: Cl O N C H
totalener: -1647.10499913 hartree
nucrepener: 1702.00842385 hartree
electener: -3349.11342298 hartree
oneelecener: -5640.39208343 hartree
twoeener: 2291.27866045 hartree
cpcmener: -0.02350581 hartree
kineticenergy: 1642.60161677 hartree
xcener: -113.421417157197 hartree
chargesum: 0.0000000
charge: -0.085614 -0.087302 -0.372035 -0.031641 -0.391956 0.224983 -0.091830 0.045123 -0.020560 -0.174584 -0.136862 0.039417 0.041652 -0.136527 -0.167233 0.101192 -0.145242 -0.164240 -0.249954 0.101563 0.124782 0.118726 0.143652 0.168235 0.155101 0.085563 0.103116 0.122749 0.146532 0.161181 0.130425 0.130011 0.111577
qa: -0.0856 -0.0873 -0.3720 -0.0316 -0.3920 0.2250 -0.0918 0.0451 -0.0206 -0.1746 -0.1369 0.0394 0.0417 -0.1365 -0.1672 0.1012 -0.1452 -0.1642 -0.2500 0.1016 0.1248 0.1187 0.1437 0.1682 0.1551 0.0856 0.1031 0.1227 0.1465 0.1612 0.1304 0.1300 0.1116
va: 1.2422 1.2160 1.9561 3.2887 3.1060 3.7991 3.9032 3.3864 3.9471 3.8597 3.8995 4.0394 3.9311 4.0745 4.0590 3.8600 4.0394 3.7480 3.9205 1.0175 1.0085 1.0085 1.0199 0.9910 1.0119 0.9982 0.9927 1.0204 1.0036 1.0030 1.0038 1.0025 1.0095
dispcorr: -0.019454768 hartree
energy: -1647.124453893606
dipole: -13.54320 13.71402 0.17081 13.46936 -11.78222 1.68714 8.48630 -9.99982 -1.51352
magnitude: 2.27297 au
magnitude: 5.77742 debye
