program: Orca
programVersion: 4.2.1
elementType: Cl Cl O N N C C C C C C C C C C C C C C H H H H H H H H H H H H H H
charge: 0
multiplicity: 1
keywords: wb97x-d3
keywords: def2-TZVPP
keywords: def2/J RIJCOSX GRIDX6 NOFINALGRIDX
keywords: grid4 nofinalgrid
keywords: scfconv7
keywords: smallprint printgap noloewdin
keywords: NOSOSCF
formula: C14H14Cl2N2O
InChI: InChI=1S/C14H14Cl2N2O/c1-2-7-19-14(9-18-6-5-17-10-18)12-4-3-11(15)8-13(12)16/h2-6,8,10,14H,1,7,9H2
33 atoms
Cl 0.391227 -0.194899 -3.151531
Cl 3.778463 -2.466469 0.311562
O  -1.161953 2.04458 0.317382
N  -2.397949 -0.610672 0.381354
N  -2.800863 -1.226519 2.458569
C  -0.975659 1.105461 -0.704224
C  -2.235714 0.241574 -0.771965
C  0.249449 0.246231 -0.474693
C  0.914778 -0.401471 -1.509429
C  0.710896 0.017387 0.818704
C  -1.995409 -1.913732 0.486008
C  -2.866261 -0.246266 1.59641
C  -0.25289 3.130465 0.279816
C  1.999303 -1.236365 -1.28672
C  1.790827 -0.807897 1.076257
C  2.427289 -1.429446 0.014776
C  -2.25782 -2.276658 1.773771
C  -0.541062 4.026875 1.435791
C  -0.698248 5.339929 1.330804
H  -0.894041 1.613385 -1.674691
H  -3.109403 0.886739 -0.872006
H  -2.199867 -0.386467 -1.660915
H  0.215371 0.495902 1.653145
H  -1.575985 -2.455825 -0.34546
H  -3.249553 0.743572 1.789587
H  0.783308 2.772083 0.347229
H  -0.341636 3.676938 -0.668013
H  2.496239 -1.724298 -2.113583
H  2.123793 -0.965046 2.092825
H  -2.086182 -3.235496 2.238406
H  -0.577507 3.553893 2.413496
H  -0.863892 5.959601 2.202731
H  -0.666417 5.848141 0.373284
elementType: Cl O N C H
totalener: -1647.10626830 hartree
nucrepener: 1673.84634812 hartree
electener: -3320.95261642 hartree
oneelecener: -5583.80776445 hartree
twoeener: 2262.85514803 hartree
cpcmener: -0.02338352 hartree
kineticenergy: 1642.58733438 hartree
xcener: -113.417450722648 hartree
chargesum: 0.0000000
charge: -0.081808 -0.085032 -0.362418 -0.028117 -0.391570 0.220530 -0.110639 0.005366 -0.025476 -0.142818 -0.133000 0.041503 0.065898 -0.132550 -0.175070 0.101851 -0.146854 -0.202398 -0.258730 0.103647 0.125691 0.124602 0.146431 0.166484 0.153989 0.106968 0.099388 0.123571 0.147598 0.160856 0.136455 0.131060 0.114593
qa: -0.0818 -0.0850 -0.3624 -0.0281 -0.3916 0.2205 -0.1106 0.0054 -0.0255 -0.1428 -0.1330 0.0415 0.0659 -0.1326 -0.1751 0.1019 -0.1469 -0.2024 -0.2587 0.1036 0.1257 0.1246 0.1464 0.1665 0.1540 0.1070 0.0994 0.1236 0.1476 0.1609 0.1365 0.1311 0.1146
va: 1.2480 1.2184 1.9598 3.2834 3.1069 3.8012 3.8672 3.4046 3.9751 3.8615 3.8994 4.0421 3.8524 4.0658 4.0657 3.8638 4.0439 3.8489 3.9486 1.0131 1.0135 1.0082 1.0135 0.9917 1.0120 0.9803 1.0030 1.0202 1.0032 1.0032 1.0035 1.0026 1.0120
dispcorr: -0.018100033 hartree
energy: -1647.124368334614
dipole: -15.02918 15.49655 0.46737 19.36743 -18.09909 1.26834 9.29263 -11.00779 -1.71516
magnitude: 2.18378 au
magnitude: 5.55072 debye
