program: Orca
programVersion: 4.2.1
elementType: Cl Cl O N N C C C C C C C C C C C C C C H H H H H H H H H H H H H H
charge: 0
multiplicity: 1
keywords: wb97x-d3
keywords: def2-TZVPP
keywords: def2/J RIJCOSX GRIDX6 NOFINALGRIDX
keywords: grid4 nofinalgrid
keywords: scfconv7
keywords: smallprint printgap noloewdin
keywords: NOSOSCF
formula: C14H14Cl2N2O
InChI: InChI=1S/C14H14Cl2N2O/c1-2-7-19-14(9-18-6-5-17-10-18)12-4-3-11(15)8-13(12)16/h2-6,8,10,14H,1,7,9H2
33 atoms
Cl 0.80559 -1.193419 -2.112825
Cl 5.247428 -0.768916 0.839088
O  -1.062998 1.432946 0.877516
N  -2.840775 -0.793059 0.40806
N  -4.745122 -0.910868 -0.694734
C  -0.645815 0.310948 0.147339
C  -1.426228 -0.897174 0.664685
C  0.836678 0.044605 0.304173
C  1.574762 -0.630804 -0.663243
C  1.507145 0.440713 1.457602
C  -3.78124 -0.191252 1.196066
C  -3.471455 -1.200128 -0.717114
C  -0.700306 2.668816 0.300723
C  2.928299 -0.888524 -0.514632
C  2.857882 0.196741 1.637746
C  3.558484 -0.463884 0.642215
C  -4.951571 -0.279913 0.499541
C  -1.587727 3.121415 -0.81632
C  -2.759156 2.601725 -1.158349
H  -0.876243 0.44327 -0.91744
H  -1.05581 -1.80544 0.189951
H  -1.265089 -1.012533 1.737198
H  0.962299 0.96044 2.234988
H  -3.546258 0.229716 2.15924
H  -2.94848 -1.710304 -1.513062
H  -0.728496 3.410667 1.104947
H  0.339533 2.656355 -0.051415
H  3.476987 -1.409456 -1.287343
H  3.354065 0.51936 2.542788
H  -5.927624 0.072761 0.796216
H  -1.200977 3.976537 -1.3640
H  -3.326581 3.016397 -1.9819
H  -3.20604 1.762582 -0.639323
elementType: Cl O N C H
totalener: -1647.10695287 hartree
nucrepener: 1652.65896735 hartree
electener: -3299.76592022 hartree
oneelecener: -5541.30072058 hartree
twoeener: 2241.53480036 hartree
cpcmener: -0.02303617 hartree
kineticenergy: 1642.57512840 hartree
xcener: -113.417954787154 hartree
chargesum: -0.0000000
charge: -0.079143 -0.083446 -0.370708 -0.021747 -0.383609 0.209761 -0.132913 0.011113 -0.023882 -0.186705 -0.138361 0.032718 0.095990 -0.132768 -0.163002 0.098919 -0.145763 -0.190868 -0.270074 0.118182 0.139880 0.136713 0.147892 0.168767 0.153646 0.111891 0.097959 0.124602 0.147032 0.159956 0.133683 0.132361 0.101925
qa: -0.0791 -0.0834 -0.3707 -0.0217 -0.3836 0.2098 -0.1329 0.0111 -0.0239 -0.1867 -0.1384 0.0327 0.0960 -0.1328 -0.1630 0.0989 -0.1458 -0.1909 -0.2701 0.1182 0.1399 0.1367 0.1479 0.1688 0.1536 0.1119 0.0980 0.1246 0.1470 0.1600 0.1337 0.1324 0.1019
va: 1.2514 1.2204 1.9470 3.2635 3.1042 3.7239 3.8031 3.4607 4.0179 3.9888 3.9027 4.0367 3.8778 4.0551 4.0297 3.8624 4.0266 3.8329 3.9466 1.0038 1.0098 1.0065 1.0215 1.0005 1.0050 0.9916 0.9908 1.0203 1.0048 1.0045 0.9994 1.0046 0.9941
dispcorr: -0.018158218 hartree
energy: -1647.125111089050
dipole: -23.23164 25.11738 1.88574 13.11356 -12.41889 0.69467 4.41533 -3.30634 1.10899
magnitude: 2.29531 au
magnitude: 5.83421 debye
