program: Orca
programVersion: 4.2.1
elementType: Cl Cl O N N C C C C C C C C C C C C C C H H H H H H H H H H H H H H
charge: 0
multiplicity: 1
keywords: wb97x-d3
keywords: def2-TZVPP
keywords: def2/J RIJCOSX GRIDX6 NOFINALGRIDX
keywords: grid4 nofinalgrid
keywords: scfconv7
keywords: smallprint printgap noloewdin
keywords: NOSOSCF
formula: C14H14Cl2N2O
InChI: InChI=1S/C14H14Cl2N2O/c1-2-7-19-14(9-18-6-5-17-10-18)12-4-3-11(15)8-13(12)16/h2-6,8,10,14H,1,7,9H2
33 atoms
Cl -0.175464 -0.51428 -2.109819
Cl 4.057684 -2.233406 0.657582
O  -0.559598 2.571094 0.948854
N  -2.324513 -0.593038 0.57544
N  -3.324931 -2.081546 -0.704708
C  -0.792755 1.333192 0.324624
C  -1.949498 0.695046 1.103107
C  0.437009 0.451975 0.358129
C  0.783195 -0.416675 -0.671338
C  1.248448 0.456584 1.490122
C  -1.764145 -1.804185 0.877558
C  -3.249675 -0.818363 -0.384705
C  0.231377 3.464936 0.198891
C  1.893668 -1.2446 -0.594178
C  2.359848 -0.359542 1.59979
C  2.672621 -1.205698 0.547937
C  -2.397635 -2.708704 0.077822
C  -0.511415 4.192255 -0.877019
C  -1.825555 4.203192 -1.056728
H  -1.113014 1.480223 -0.713237
H  -1.67712 0.583778 2.153726
H  -2.818436 1.352522 1.060744
H  1.008342 1.119032 2.311939
H  -0.993356 -1.916815 1.62189
H  -3.844376 -0.019776 -0.80281
H  0.6401 4.192471 0.906949
H  1.102225 2.959742 -0.239647
H  2.141524 -1.907112 -1.411958
H  2.970098 -0.334101 2.491913
H  -2.23765 -3.774898 0.030396
H  0.125292 4.766666 -1.543729
H  -2.269138 4.771064 -1.864205
H  -2.512139 3.659712 -0.418924
elementType: Cl O N C H
totalener: -1647.10454538 hartree
nucrepener: 1698.53895347 hartree
electener: -3345.64349885 hartree
oneelecener: -5633.38648284 hartree
twoeener: 2287.74298399 hartree
cpcmener: -0.02462145 hartree
kineticenergy: 1642.58846844 hartree
xcener: -113.421317926571 hartree
chargesum: 0.0000000
charge: -0.075426 -0.083349 -0.384116 -0.038453 -0.381106 0.189262 -0.079254 -0.061112 0.036407 -0.158016 -0.137903 0.023723 0.104897 -0.126445 -0.175439 0.104929 -0.148761 -0.189582 -0.290701 0.123049 0.132135 0.117710 0.142950 0.174340 0.161934 0.112000 0.092562 0.124219 0.146433 0.160755 0.132870 0.132253 0.117233
qa: -0.0754 -0.0833 -0.3841 -0.0385 -0.3811 0.1893 -0.0793 -0.0611 0.0364 -0.1580 -0.1379 0.0237 0.1049 -0.1264 -0.1754 0.1049 -0.1488 -0.1896 -0.2907 0.1230 0.1321 0.1177 0.1430 0.1743 0.1619 0.1120 0.0926 0.1242 0.1464 0.1608 0.1329 0.1323 0.1172
va: 1.2513 1.2206 1.9318 3.2913 3.1035 3.7607 3.8395 3.4473 3.9344 3.9634 3.8985 4.0564 3.8868 4.0587 4.0425 3.8580 4.0546 3.8026 3.9407 1.0025 0.9993 1.0127 1.0230 0.9887 0.9989 0.9922 0.9931 1.0201 1.0045 1.0036 1.0030 1.0043 1.0130
dispcorr: -0.019069564 hartree
energy: -1647.123614942518
dipole: -14.33897 15.43136 1.09239 19.65800 -17.71107 1.94692 5.27271 -4.07167 1.20104
magnitude: 2.53502 au
magnitude: 6.44350 debye
