program: Orca
programVersion: 4.2.1
elementType: Cl Cl O N N C C C C C C C C C C C C C C H H H H H H H H H H H H H H
charge: 0
multiplicity: 1
keywords: wb97x-d3
keywords: def2-TZVPP
keywords: def2/J RIJCOSX GRIDX6 NOFINALGRIDX
keywords: grid4 nofinalgrid
keywords: scfconv7
keywords: smallprint printgap noloewdin
keywords: NOSOSCF
formula: C14H14Cl2N2O
InChI: InChI=1S/C14H14Cl2N2O/c1-2-7-19-14(9-18-6-5-17-10-18)12-4-3-11(15)8-13(12)16/h2-6,8,10,14H,1,7,9H2
33 atoms
Cl 0.671218 0.109919 2.527882
Cl 5.267964 -0.897146 0.016202
O  -1.145135 1.201948 0.38158
N  -2.864337 -1.004694 -0.21898
N  -4.97753 -0.401932 -0.064961
C  -0.671529 0.098466 -0.341473
C  -1.464704 -1.128601 0.106685
C  0.817731 -0.131816 -0.188592
C  1.49508 -0.154858 1.028914
C  1.570847 -0.350313 -1.338465
C  -3.435987 -1.281808 -1.430291
C  -3.830587 -0.468561 0.558297
C  -0.694595 2.450697 -0.084782
C  2.860411 -0.388677 1.100321
C  2.933231 -0.591587 -1.300215
C  3.567004 -0.606924 -0.070045
C  -4.74223 -0.906744 -1.312423
C  -1.454054 2.988425 -1.256652
C  -2.586932 2.507018 -1.75074
H  -0.859934 0.234429 -1.416109
H  -1.067726 -2.015307 -0.386182
H  -1.369402 -1.28414 1.180707
H  1.073328 -0.324277 -2.300279
H  -2.879668 -1.720074 -2.242645
H  -3.641675 -0.153573 1.573153
H  -0.785837 3.150157 0.751926
H  0.375447 2.42788 -0.330765
H  3.362363 -0.401132 2.057891
H  3.486393 -0.753951 -2.214767
H  -5.522045 -0.9817 -2.054706
H  -1.007267 3.871354 -1.70495
H  -3.064143 2.980302 -2.598952
H  -3.086734 1.637734 -1.342231
elementType: Cl O N C H
totalener: -1647.10342810 hartree
nucrepener: 1657.75474920 hartree
electener: -3304.85817730 hartree
oneelecener: -5551.62436640 hartree
twoeener: 2246.76618910 hartree
cpcmener: -0.02550457 hartree
kineticenergy: 1642.59594772 hartree
xcener: -113.420235409822 hartree
chargesum: 0.0000000
charge: -0.075658 -0.083099 -0.348192 -0.026841 -0.385775 0.213980 -0.111900 -0.095011 0.003234 -0.095668 -0.153937 0.036187 0.089395 -0.147335 -0.183909 0.117022 -0.147047 -0.182804 -0.274697 0.116529 0.130724 0.134682 0.144053 0.177669 0.154631 0.108711 0.092581 0.122497 0.145561 0.159627 0.133044 0.131063 0.100681
qa: -0.0757 -0.0831 -0.3482 -0.0268 -0.3858 0.2140 -0.1119 -0.0950 0.0032 -0.0957 -0.1539 0.0362 0.0894 -0.1473 -0.1839 0.1170 -0.1470 -0.1828 -0.2747 0.1165 0.1307 0.1347 0.1441 0.1777 0.1546 0.1087 0.0926 0.1225 0.1456 0.1596 0.1330 0.1311 0.1007
va: 1.2440 1.2203 1.9502 3.2804 3.1008 3.7455 3.8166 3.5307 4.0013 3.9109 3.8981 4.0475 3.9066 4.0853 4.0392 3.8425 4.0338 3.8200 3.9485 0.9967 1.0076 1.0134 0.9996 0.9903 1.0084 0.9935 0.9932 1.0241 1.0061 1.0044 0.9993 1.0053 0.9950
dispcorr: -0.018148689 hartree
energy: -1647.121576791619
dipole: -22.07782 24.24814 2.17032 7.22421 -7.49143 -0.26722 -13.96063 12.75307 -1.20756
magnitude: 2.49798 au
magnitude: 6.34936 debye
