program: Orca
programVersion: 4.2.1
elementType: Cl Cl O N N C C C C C C C C C C C C C C H H H H H H H H H H H H H H
charge: 0
multiplicity: 1
keywords: wb97x-d3
keywords: def2-TZVPP
keywords: def2/J RIJCOSX GRIDX6 NOFINALGRIDX
keywords: grid4 nofinalgrid
keywords: scfconv7
keywords: smallprint printgap noloewdin
keywords: NOSOSCF
formula: C14H14Cl2N2O
InChI: InChI=1S/C14H14Cl2N2O/c1-2-7-19-14(9-18-6-5-17-10-18)12-4-3-11(15)8-13(12)16/h2-6,8,10,14H,1,7,9H2
33 atoms
Cl 0.50589 -1.832895 -2.034344
Cl 5.190164 -0.735801 0.305596
O  -1.12196 1.434216 0.444672
N  -2.913717 -0.82027 0.488539
N  -5.007429 -0.15151 0.665091
C  -0.75316 0.202051 -0.098128
C  -1.49245 -0.875393 0.69618
C  0.741198 -0.027321 -0.021644
C  1.396311 -0.935068 -0.84726
C  1.511259 0.649957 0.918389
C  -3.609708 -1.447319 -0.511131
C  -3.805736 -0.04633 1.153702
C  -0.95299 2.52611 -0.420249
C  2.759923 -1.162998 -0.759167
C  2.8751 0.442924 1.03042
C  3.492028 -0.465206 0.185976
C  -4.898702 -1.02222 -0.377449
C  -1.232891 3.807056 0.288042
C  -1.59482 3.935624 1.555936
H  -1.075843 0.13138 -1.14709
H  -1.132337 -1.86324 0.409607
H  -1.275825 -0.752313 1.759235
H  1.031226 1.365912 1.572396
H  -3.136261 -2.129156 -1.197801
H  -3.513528 0.572564 1.987963
H  0.069929 2.559288 -0.824925
H  -1.623823 2.433374 -1.287437
H  3.24046 -1.871674 -1.418405
H  3.45249 0.98407 1.766556
H  -5.753139 -1.30434 -0.971822
H  -1.119488 4.691726 -0.329848
H  -1.778835 4.911992 1.981374
H  -1.729546 3.086735 2.21099
totalener: -1647.08466585 hartree
nucrepener: 1633.46540305 hartree
electener: -3280.55006890 hartree
oneelecener: -5502.75136224 hartree
twoeener: 2222.20129334 hartree
kineticenergy: 1642.61906923 hartree
xcener: -113.422466885418 hartree
chargesum: 0.0000000
charge: -0.069046 -0.063440 -0.338016 -0.036392 -0.313036 0.200094 -0.162991 0.021533 -0.044645 -0.153746 -0.121493 0.052336 0.075692 -0.125769 -0.148707 0.089649 -0.108610 -0.155792 -0.221711 0.109921 0.127640 0.126578 0.138642 0.142444 0.121505 0.092182 0.094662 0.117773 0.127616 0.124179 0.103475 0.105725 0.091748
qa: -0.0690 -0.0634 -0.3380 -0.0364 -0.3130 0.2001 -0.1630 0.0215 -0.0446 -0.1537 -0.1215 0.0523 0.0757 -0.1258 -0.1487 0.0896 -0.1086 -0.1558 -0.2217 0.1099 0.1276 0.1266 0.1386 0.1424 0.1215 0.0922 0.0947 0.1178 0.1276 0.1242 0.1035 0.1057 0.0917
va: 1.2638 1.2416 1.9777 3.2729 3.1380 3.7453 3.8533 3.4348 4.0312 3.9775 3.8866 4.0626 3.8794 4.0415 4.0462 3.9326 4.0800 3.8905 3.9724 1.0073 1.0141 1.0097 1.0218 1.0050 1.0111 0.9815 0.9949 1.0215 1.0119 1.0100 1.0090 1.0089 1.0248
dispcorr: -0.016856483 hartree
energy: -1647.101522330035
dipole: -20.87217 22.32337 1.45119 15.54998 -15.42280 0.12718 6.56219 -6.78881 -0.22662
magnitude: 1.47428 au
magnitude: 3.74732 debye
