program: Orca
programVersion: 4.2.1
elementType: Cl Cl O N N C C C C C C C C C C C C C C H H H H H H H H H H H H H H
charge: 0
multiplicity: 1
keywords: wb97x-d3
keywords: def2-TZVPP
keywords: def2/J RIJCOSX GRIDX6 NOFINALGRIDX
keywords: grid4 nofinalgrid
keywords: scfconv7
keywords: smallprint printgap noloewdin
keywords: NOSOSCF
formula: C14H14Cl2N2O
InChI: InChI=1S/C14H14Cl2N2O/c1-2-7-19-14(9-18-6-5-17-10-18)12-4-3-11(15)8-13(12)16/h2-6,8,10,14H,1,7,9H2
33 atoms
Cl 0.834455 0.491751 -2.842464
Cl 3.758691 -2.64745 0.350932
O  -1.078791 1.936489 0.847176
N  -2.389766 -0.577592 0.237723
N  -3.057233 -1.521491 2.116721
C  -0.801866 1.235253 -0.335598
C  -2.06281 0.453711 -0.710622
C  0.374888 0.298614 -0.172044
C  1.157676 -0.107929 -1.246659
C  0.665246 -0.252491 1.072673
C  -2.030178 -1.897387 0.162748
C  -2.995813 -0.410568 1.440574
C  -0.202057 3.003747 1.106475
C  2.201605 -1.008307 -1.101536
C  1.698227 -1.154964 1.248022
C  2.464472 -1.524788 0.154944
C  -2.455501 -2.458491 1.33008
C  -0.529573 4.256891 0.352271
C  -1.656466 4.495209 -0.303202
H  -0.603891 1.932849 -1.159461
H  -2.90219 1.146604 -0.794579
H  -1.922646 -0.002186 -1.690601
H  0.059504 0.023204 1.925533
H  -1.513805 -2.303274 -0.690852
H  -3.375512 0.547112 1.761383
H  -0.260728 3.204402 2.180695
H  0.841065 2.720081 0.909764
H  2.796047 -1.300466 -1.955337
H  1.897375 -1.574505 2.223754
H  -2.364189 -3.486784 1.641693
H  0.240826 5.021295 0.383809
H  -1.817543 5.433616 -0.814644
H  -2.460637 3.772759 -0.352771
totalener: -1647.08282975 hartree
nucrepener: 1688.44395824 hartree
electener: -3335.52678798 hartree
oneelecener: -5613.01219295 hartree
twoeener: 2277.48540497 hartree
kineticenergy: 1642.62080846 hartree
xcener: -113.426018169176 hartree
chargesum: 0.0000000
charge: -0.073094 -0.066125 -0.349870 -0.035759 -0.305985 0.191589 -0.126378 -0.046229 -0.012907 -0.103456 -0.125736 0.037833 0.078879 -0.148124 -0.156621 0.104970 -0.101621 -0.168196 -0.226085 0.124960 0.112152 0.117526 0.139243 0.140731 0.129240 0.102325 0.087203 0.115561 0.128107 0.124160 0.104955 0.108938 0.097814
qa: -0.0731 -0.0661 -0.3499 -0.0358 -0.3060 0.1916 -0.1264 -0.0462 -0.0129 -0.1035 -0.1257 0.0378 0.0789 -0.1481 -0.1566 0.1050 -0.1016 -0.1682 -0.2261 0.1250 0.1122 0.1175 0.1392 0.1407 0.1292 0.1023 0.0872 0.1156 0.1281 0.1242 0.1050 0.1089 0.0978
va: 1.2590 1.2383 1.9609 3.2703 3.1342 3.7714 3.9215 3.5075 3.9977 3.8766 3.8871 4.0516 3.9033 4.0875 4.0840 3.9155 4.0576 3.8506 3.9614 1.0010 1.0096 1.0111 1.0191 1.0003 1.0155 0.9917 0.9914 1.0232 1.0106 1.0106 1.0102 1.0092 1.0196
dispcorr: -0.018854368 hartree
energy: -1647.101684117100
dipole: -17.16457 17.75561 0.59104 17.12339 -15.96346 1.15993 6.79470 -7.67896 -0.88426
magnitude: 1.57375 au
magnitude: 4.00015 debye
