program: Orca
programVersion: 4.2.1
elementType: Cl Cl O N N C C C C C C C C C C C C C C H H H H H H H H H H H H H H
charge: 0
multiplicity: 1
keywords: wb97x-d3
keywords: def2-TZVPP
keywords: def2/J RIJCOSX GRIDX6 NOFINALGRIDX
keywords: grid4 nofinalgrid
keywords: scfconv7
keywords: smallprint printgap noloewdin
keywords: NOSOSCF
formula: C14H14Cl2N2O
InChI: InChI=1S/C14H14Cl2N2O/c1-2-7-19-14(9-18-6-5-17-10-18)12-4-3-11(15)8-13(12)16/h2-6,8,10,14H,1,7,9H2
33 atoms
Cl 0.739623 -1.604684 -1.919186
Cl 5.28995 -0.982501 0.824146
O  -0.90584 1.485108 0.770399
N  -2.810727 -0.649819 0.398381
N  -4.677314 -0.753238 -0.774688
C  -0.561807 0.296269 0.120714
C  -1.418343 -0.821453 0.717198
C  0.910265 -0.019087 0.277922
C  1.58134 -0.875329 -0.589642
C  1.641792 0.522965 1.32906
C  -3.71482 0.157152 1.033457
C  -3.44476 -1.161927 -0.686979
C  -0.893721 2.639435 -0.050329
C  2.924206 -1.179085 -0.436285
C  2.983371 0.235085 1.510636
C  3.617737 -0.615977 0.621027
C  -4.858752 0.072097 0.29529
C  -2.187852 2.817232 -0.780006
C  -2.887505 3.94237 -0.774011
H  -0.796251 0.351282 -0.951279
H  -1.091464 -1.788651 0.334595
H  -1.289331 -0.844293 1.800788
H  1.148834 1.194979 2.017979
H  -3.464846 0.713309 1.919728
H  -2.950483 -1.840646 -1.367128
H  -0.709821 3.494191 0.603668
H  -0.054596 2.594903 -0.757961
H  3.419025 -1.841618 -1.131885
H  3.530568 0.670497 2.334723
H  -5.802202 0.559957 0.481179
H  -2.55472 1.96731 -1.348814
H  -3.809074 4.03716 -1.330866
H  -2.567294 4.813444 -0.214877
totalener: -1647.08223304 hartree
nucrepener: 1639.23818290 hartree
electener: -3286.32041593 hartree
oneelecener: -5514.41627456 hartree
twoeener: 2228.09585863 hartree
kineticenergy: 1642.62080146 hartree
xcener: -113.420648637124 hartree
chargesum: 0.0000000
charge: -0.069461 -0.064284 -0.347808 -0.022778 -0.303797 0.217442 -0.153414 -0.005046 -0.036208 -0.150650 -0.112924 0.015815 0.069176 -0.131952 -0.149145 0.095314 -0.105698 -0.134969 -0.214901 0.111176 0.126528 0.125044 0.134662 0.142373 0.125067 0.089711 0.086220 0.117532 0.126248 0.122347 0.107237 0.108303 0.082841
qa: -0.0695 -0.0643 -0.3478 -0.0228 -0.3038 0.2174 -0.1534 -0.0050 -0.0362 -0.1506 -0.1129 0.0158 0.0692 -0.1320 -0.1491 0.0953 -0.1057 -0.1350 -0.2149 0.1112 0.1265 0.1250 0.1347 0.1424 0.1251 0.0897 0.0862 0.1175 0.1262 0.1223 0.1072 0.1083 0.0828
va: 1.2637 1.2409 1.9500 3.2678 3.1316 3.7243 3.8388 3.5238 4.0302 3.9850 3.8934 4.0496 3.9002 4.0488 4.0382 3.9325 4.0505 3.8417 3.9928 0.9983 1.0171 1.0096 1.0285 1.0136 1.0103 1.0008 0.9916 1.0221 1.0130 1.0119 1.0048 1.0085 1.0162
dispcorr: -0.017550971 hartree
energy: -1647.099784007441
dipole: -24.14111 25.34458 1.20347 16.74166 -16.12890 0.61276 3.66034 -2.99825 0.66209
magnitude: 1.50405 au
magnitude: 3.82300 debye
