program: Orca
programVersion: 4.2.1
elementType: Cl Cl O N N C C C C C C C C C C C C C C H H H H H H H H H H H H H H
charge: 0
multiplicity: 1
keywords: wb97x-d3
keywords: def2-TZVPP
keywords: def2/J RIJCOSX GRIDX6 NOFINALGRIDX
keywords: grid4 nofinalgrid
keywords: scfconv7
keywords: smallprint printgap noloewdin
keywords: NOSOSCF
formula: C14H14Cl2N2O
InChI: InChI=1S/C14H14Cl2N2O/c1-2-7-19-14(9-18-6-5-17-10-18)12-4-3-11(15)8-13(12)16/h2-6,8,10,14H,1,7,9H2
33 atoms
Cl 0.446279 -1.875788 -1.987646
Cl 5.204248 -0.778694 0.198541
O  -1.099252 1.393872 0.539447
N  -2.889863 -0.851012 0.655746
N  -4.968799 -0.15738 0.900585
C  -0.748535 0.15958 -0.009905
C  -1.462084 -0.91566 0.81091
C  0.746877 -0.071706 0.017361
C  1.374736 -0.978234 -0.830418
C  1.546501 0.60335 0.933926
C  -3.627708 -1.478453 -0.312928
C  -3.74914 -0.06254 1.346085
C  -0.972645 2.485546 -0.348847
C  2.740723 -1.205386 -0.787101
C  2.913258 0.396568 1.001732
C  3.502742 -0.509016 0.135078
C  -4.906802 -1.038946 -0.137049
C  -1.452211 3.715923 0.343861
C  -0.738556 4.827469 0.447404
H  -1.105033 0.08654 -1.048011
H  -1.11905 -1.905237 0.509392
H  -1.205676 -0.79496 1.865348
H  1.084931 1.314902 1.605799
H  -3.185918 -2.169919 -1.010925
H  -3.42106 0.557163 2.166318
H  0.065616 2.615092 -0.681648
H  -1.580779 2.301705 -1.246313
H  3.200191 -1.912771 -1.462526
H  3.514295 0.934984 1.720757
H  -5.785125 -1.31687 -0.697553
H  -2.457403 3.672894 0.750558
H  -1.133628 5.712956 0.925659
H  0.266811 4.899959 0.050533
totalener: -1647.08484441 hartree
nucrepener: 1624.96737545 hartree
electener: -3272.05221986 hartree
oneelecener: -5485.77623774 hartree
twoeener: 2213.72401787 hartree
kineticenergy: 1642.62080341 hartree
xcener: -113.419268218721 hartree
chargesum: -0.0000000
charge: -0.069766 -0.064067 -0.337037 -0.035936 -0.313389 0.208428 -0.161256 0.029226 -0.047051 -0.171573 -0.120839 0.041541 0.054106 -0.122945 -0.142043 0.085928 -0.109479 -0.157461 -0.208742 0.105894 0.127043 0.127607 0.140369 0.142323 0.127751 0.091376 0.094703 0.117489 0.127810 0.124397 0.119761 0.107753 0.088079
qa: -0.0698 -0.0641 -0.3370 -0.0359 -0.3134 0.2084 -0.1613 0.0292 -0.0471 -0.1716 -0.1208 0.0415 0.0541 -0.1229 -0.1420 0.0859 -0.1095 -0.1575 -0.2087 0.1059 0.1270 0.1276 0.1404 0.1423 0.1278 0.0914 0.0947 0.1175 0.1278 0.1244 0.1198 0.1078 0.0881
va: 1.2628 1.2409 1.9669 3.2797 3.1321 3.7433 3.8514 3.4396 4.0354 3.9777 3.8880 4.0574 3.8771 4.0393 4.0324 3.9400 4.0800 3.8935 3.9676 1.0104 1.0142 1.0095 1.0264 1.0048 1.0128 0.9908 0.9949 1.0215 1.0120 1.0100 1.0093 1.0088 1.0143
dispcorr: -0.016421809 hartree
energy: -1647.101266223037
dipole: -19.76864 21.16310 1.39446 16.73083 -16.56106 0.16977 5.58779 -5.80493 -0.21714
magnitude: 1.42144 au
magnitude: 3.61301 debye
