program: Orca
programVersion: 4.2.1
elementType: Cl Cl O N N C C C C C C C C C C C C C C H H H H H H H H H H H H H H
charge: 0
multiplicity: 1
keywords: wb97x-d3
keywords: def2-TZVPP
keywords: def2/J RIJCOSX GRIDX6 NOFINALGRIDX
keywords: grid4 nofinalgrid
keywords: scfconv7
keywords: smallprint printgap noloewdin
keywords: NOSOSCF
formula: C14H14Cl2N2O
InChI: InChI=1S/C14H14Cl2N2O/c1-2-7-19-14(9-18-6-5-17-10-18)12-4-3-11(15)8-13(12)16/h2-6,8,10,14H,1,7,9H2
33 atoms
Cl -0.315871 -0.335479 -2.070949
Cl 4.080659 -1.987306 0.470628
O  -0.806364 2.498661 1.199093
N  -2.379685 -0.738218 0.667899
N  -3.329138 -2.192562 -0.693764
C  -0.977493 1.290745 0.506201
C  -2.063204 0.528075 1.273508
C  0.303578 0.489087 0.442937
C  0.671842 -0.279911 -0.655637
C  1.147372 0.468796 1.550449
C  -1.737965 -1.932783 0.862143
C  -3.32045 -0.958254 -0.284031
C  -0.027065 3.463268 0.517143
C  1.830963 -1.043104 -0.657458
C  2.307581 -0.282706 1.576729
C  2.640504 -1.038622 0.463357
C  -2.342053 -2.812196 0.01258
C  -0.680474 3.950074 -0.738271
C  -0.148153 3.811406 -1.944722
H  -1.342226 1.474449 -0.511109
H  -1.745133 0.363628 2.304623
H  -2.968142 1.136777 1.308668
H  0.888835 1.065186 2.416391
H  -0.931835 -2.044969 1.567391
H  -3.977349 -0.172682 -0.628157
H  0.094583 4.28659 1.224529
H  0.975113 3.077533 0.29033
H  2.090803 -1.635587 -1.522917
H  2.945501 -0.281293 2.449151
H  -2.120863 -3.859153 -0.120188
H  -1.644749 4.436492 -0.626138
H  -0.639523 4.186109 -2.832092
H  0.806777 3.320799 -2.090759
totalener: -1647.08187173 hartree
nucrepener: 1706.63817856 hartree
electener: -3353.72005029 hartree
oneelecener: -5649.58724479 hartree
twoeener: 2295.86719450 hartree
kineticenergy: 1642.62988081 hartree
xcener: -113.425759373605 hartree
chargesum: 0.0000000
charge: -0.052095 -0.065357 -0.333168 -0.033987 -0.297397 0.207902 -0.123940 -0.039125 0.027035 -0.174061 -0.131218 0.021100 0.056174 -0.124153 -0.152097 0.092859 -0.100816 -0.194548 -0.185909 0.103110 0.118887 0.108193 0.132800 0.147348 0.124607 0.099746 0.080617 0.117177 0.126983 0.123870 0.116834 0.110342 0.092287
qa: -0.0521 -0.0654 -0.3332 -0.0340 -0.2974 0.2079 -0.1239 -0.0391 0.0270 -0.1741 -0.1312 0.0211 0.0562 -0.1242 -0.1521 0.0929 -0.1008 -0.1945 -0.1859 0.1031 0.1189 0.1082 0.1328 0.1473 0.1246 0.0997 0.0806 0.1172 0.1270 0.1239 0.1168 0.1103 0.0923
va: 1.2704 1.2396 1.9947 3.2678 3.1341 3.7769 3.8651 3.4262 3.9589 3.9494 3.8922 4.0710 3.9411 4.0528 4.0499 3.9333 4.0674 3.8248 3.9333 1.0204 1.0023 1.0174 1.0267 0.9974 1.0062 0.9915 0.9955 1.0219 1.0116 1.0110 1.0094 1.0085 1.0150
dispcorr: -0.019375997 hartree
energy: -1647.101247728126
dipole: -12.34532 13.01400 0.66868 17.54452 -16.07894 1.46558 5.17894 -4.42886 0.75008
magnitude: 1.77699 au
magnitude: 4.51675 debye
