program: Orca
programVersion: 4.2.1
elementType: Cl Cl O N N C C C C C C C C C C C C C C H H H H H H H H H H H H H H
charge: 0
multiplicity: 1
keywords: wb97x-d3
keywords: def2-TZVPP
keywords: def2/J RIJCOSX GRIDX6 NOFINALGRIDX
keywords: grid4 nofinalgrid
keywords: scfconv7
keywords: smallprint printgap noloewdin
keywords: NOSOSCF
formula: C14H14Cl2N2O
InChI: InChI=1S/C14H14Cl2N2O/c1-2-7-19-14(9-18-6-5-17-10-18)12-4-3-11(15)8-13(12)16/h2-6,8,10,14H,1,7,9H2
33 atoms
Cl 0.395765 -1.549687 -2.097251
Cl 5.155669 -0.494237 0.105439
O  -1.25063 1.24197 0.905248
N  -2.909511 -1.091062 0.684455
N  -5.017097 -0.574367 1.078583
C  -0.841978 0.133709 0.159508
C  -1.476902 -1.100961 0.805754
C  0.663736 -0.018229 0.128883
C  1.31093 -0.769981 -0.846308
C  1.455859 0.575152 1.10608
C  -3.633864 -1.56842 -0.375768
C  -3.794608 -0.494235 1.519326
C  -1.499417 2.426537 0.173129
C  2.68771 -0.925076 -0.867617
C  2.832416 0.435547 1.112751
C  3.440878 -0.315207 0.120321
C  -4.93021 -1.240045 -0.107439
C  -0.261425 3.108741 -0.32211
C  0.114279 4.318033 0.069543
H  -1.216882 0.20408 -0.87214
H  -1.090579 -2.009862 0.34484
H  -1.203457 -1.134498 1.862023
H  0.982345 1.177055 1.869182
H  -3.171753 -2.094558 -1.194475
H  -3.482613 -0.020859 2.437505
H  -2.166437 2.204315 -0.670788
H  -2.045044 3.086941 0.848759
H  3.161569 -1.509174 -1.643474
H  3.426962 0.911308 1.879718
H  -5.804344 -1.4585 -0.69999
H  0.339818 2.579085 -1.054806
H  1.001848 4.793269 -0.32511
H  -0.455677 4.885377 0.795452
totalener: -1647.08226026 hartree
nucrepener: 1642.63694917 hartree
electener: -3289.71920943 hartree
oneelecener: -5521.17825794 hartree
twoeener: 2231.45904851 hartree
kineticenergy: 1642.62384591 hartree
xcener: -113.421603432221 hartree
chargesum: -0.0000000
charge: -0.072130 -0.065076 -0.343781 -0.031108 -0.311320 0.243075 -0.165132 -0.041362 -0.026410 -0.131062 -0.122531 0.038814 0.055308 -0.128768 -0.145502 0.090744 -0.109573 -0.157547 -0.197794 0.107954 0.128680 0.126576 0.133283 0.142131 0.128352 0.085587 0.085876 0.116831 0.126848 0.123809 0.119958 0.107448 0.087823
qa: -0.0721 -0.0651 -0.3438 -0.0311 -0.3113 0.2431 -0.1651 -0.0414 -0.0264 -0.1311 -0.1225 0.0388 0.0553 -0.1288 -0.1455 0.0907 -0.1096 -0.1575 -0.1978 0.1080 0.1287 0.1266 0.1333 0.1421 0.1284 0.0856 0.0859 0.1168 0.1268 0.1238 0.1200 0.1074 0.0878
va: 1.2609 1.2399 1.9652 3.2776 3.1317 3.6888 3.8526 3.4499 4.0049 3.9549 3.8856 4.0568 3.9226 4.0477 4.0452 3.9320 4.0806 3.8150 3.9610 1.0073 1.0159 1.0100 1.0341 1.0053 1.0124 0.9977 1.0030 1.0219 1.0118 1.0102 0.9950 1.0085 1.0165
dispcorr: -0.017303164 hartree
energy: -1647.099563426144
dipole: -18.74981 20.07867 1.32885 13.97906 -13.63943 0.33963 5.90018 -6.14191 -0.24173
magnitude: 1.39271 au
magnitude: 3.53998 debye
