program: Orca
programVersion: 4.2.1
elementType: Cl Cl O N N C C C C C C C C C C C C C C H H H H H H H H H H H H H H
charge: 0
multiplicity: 1
keywords: wb97x-d3
keywords: def2-TZVPP
keywords: def2/J RIJCOSX GRIDX6 NOFINALGRIDX
keywords: grid4 nofinalgrid
keywords: scfconv7
keywords: smallprint printgap noloewdin
keywords: NOSOSCF
formula: C14H14Cl2N2O
InChI: InChI=1S/C14H14Cl2N2O/c1-2-7-19-14(9-18-6-5-17-10-18)12-4-3-11(15)8-13(12)16/h2-6,8,10,14H,1,7,9H2
33 atoms
Cl 0.449578 -1.14384 -2.166461
Cl 5.082847 -0.341827 0.385189
O  -1.361103 1.239991 1.074477
N  -2.995387 -1.071645 0.521423
N  -4.947306 -1.32456 -0.477686
C  -0.919325 0.215137 0.22829
C  -1.567375 -1.089173 0.698657
C  0.587068 0.08716 0.248317
C  1.29182 -0.523488 -0.783712
C  1.32303 0.551657 1.333071
C  -3.924084 -0.461424 1.320316
C  -3.670409 -1.565363 -0.546889
C  -1.731437 2.436447 0.415595
C  2.670183 -0.66141 -0.756736
C  2.700059 0.425754 1.390148
C  3.366454 -0.180897 0.338526
C  -5.119424 -0.635556 0.685721
C  -0.599392 3.077749 -0.323355
C  -0.617626 3.311163 -1.628457
H  -1.246273 0.395811 -0.804088
H  -1.162282 -1.929459 0.134147
H  -1.328292 -1.262409 1.749445
H  0.803288 1.033963 2.149446
H  -3.657911 0.025312 2.242047
H  -3.167572 -2.100235 -1.33965
H  -2.571254 2.254082 -0.267002
H  -2.094129 3.098308 1.205133
H  3.189673 -1.133798 -1.578142
H  3.249653 0.797428 2.243357
H  -6.093802 -0.305703 1.009285
H  0.27102 3.356805 0.262031
H  0.210972 3.787566 -2.133942
H  -1.46734 3.038723 -2.243242
totalener: -1647.08373762 hartree
nucrepener: 1653.09135186 hartree
electener: -3300.17508948 hartree
oneelecener: -5542.19425801 hartree
twoeener: 2242.01916852 hartree
kineticenergy: 1642.62597664 hartree
xcener: -113.422349669708 hartree
chargesum: -0.0000000
charge: -0.071409 -0.066225 -0.353295 -0.029499 -0.310955 0.223354 -0.152748 0.047688 -0.035885 -0.189703 -0.124603 0.034446 0.046450 -0.127875 -0.133950 0.086526 -0.105647 -0.152142 -0.198618 0.101246 0.123829 0.124970 0.134261 0.144683 0.124273 0.087941 0.089407 0.115890 0.126853 0.123525 0.115029 0.109195 0.092990
qa: -0.0714 -0.0662 -0.3533 -0.0295 -0.3110 0.2234 -0.1527 0.0477 -0.0359 -0.1897 -0.1246 0.0344 0.0465 -0.1279 -0.1340 0.0865 -0.1056 -0.1521 -0.1986 0.1012 0.1238 0.1250 0.1343 0.1447 0.1243 0.0879 0.0894 0.1159 0.1269 0.1235 0.1150 0.1092 0.0930
va: 1.2599 1.2390 1.9495 3.2812 3.1389 3.7129 3.8538 3.4911 4.0263 3.9740 3.8929 4.0440 3.9333 4.0465 4.0263 3.9386 4.0615 3.8079 3.9537 1.0132 1.0172 1.0086 1.0309 1.0119 1.0088 0.9972 0.9942 1.0222 1.0116 1.0105 1.0081 1.0095 1.0133
dispcorr: -0.017769155 hartree
energy: -1647.101506776874
dipole: -20.68243 21.85319 1.17076 12.20792 -11.44562 0.76231 5.26933 -4.71190 0.55743
magnitude: 1.50417 au
magnitude: 3.82330 debye
