program: Orca
programVersion: 4.2.1
elementType: Cl Cl O N N C C C C C C C C C C C C C C H H H H H H H H H H H H H H
charge: 0
multiplicity: 1
keywords: wb97x-d3
keywords: def2-TZVPP
keywords: def2/J RIJCOSX GRIDX6 NOFINALGRIDX
keywords: grid4 nofinalgrid
keywords: scfconv7
keywords: smallprint printgap noloewdin
keywords: NOSOSCF
formula: C14H14Cl2N2O
InChI: InChI=1S/C14H14Cl2N2O/c1-2-7-19-14(9-18-6-5-17-10-18)12-4-3-11(15)8-13(12)16/h2-6,8,10,14H,1,7,9H2
33 atoms
Cl 0.628925 0.289497 -2.9743
Cl 3.754092 -2.602989 0.261477
O  -1.129656 1.947292 0.699082
N  -2.417305 -0.628295 0.349908
N  -2.949801 -1.451406 2.326258
C  -0.899974 1.164947 -0.437257
C  -2.167264 0.340795 -0.683141
C  0.300581 0.257889 -0.277198
C  1.038149 -0.203883 -1.361095
C  0.660141 -0.2095 0.983709
C  -2.047079 -1.947191 0.337839
C  -2.946806 -0.387196 1.576145
C  -0.216839 3.011041 0.901159
C  2.102546 -1.079257 -1.211891
C  1.715145 -1.084794 1.164122
C  2.433864 -1.512368 0.059783
C  -2.390128 -2.433727 1.564246
C  -0.526066 4.207376 0.056067
C  -0.817151 5.401452 0.552142
H  -0.76307 1.791926 -1.328159
H  -3.020966 1.016229 -0.760788
H  -2.076246 -0.178902 -1.636815
H  0.091961 0.111913 1.846536
H  -1.582556 -2.404862 -0.519335
H  -3.316682 0.586675 1.856979
H  -0.283588 3.276055 1.957849
H  0.812913 2.676433 0.718734
H  2.65989 -1.416554 -2.073995
H  1.968282 -1.438687 2.153269
H  -2.266507 -3.438551 1.935512
H  -0.484562 4.079904 -1.021688
H  -1.010947 6.251701 -0.087242
H  -0.863652 5.579731 1.619706
totalener: -1647.08134940 hartree
nucrepener: 1676.28406732 hartree
electener: -3323.36541672 hartree
oneelecener: -5588.66818352 hartree
twoeener: 2265.30276680 hartree
kineticenergy: 1642.62215619 hartree
xcener: -113.423573875607 hartree
chargesum: 0.0000000
charge: -0.075507 -0.065619 -0.342717 -0.039183 -0.306307 0.227457 -0.131138 -0.037762 -0.016147 -0.115646 -0.124634 0.037059 0.066959 -0.143173 -0.150619 0.099586 -0.102520 -0.167060 -0.199948 0.098401 0.116009 0.115345 0.140861 0.139425 0.130419 0.092998 0.090146 0.115975 0.128533 0.124360 0.102315 0.106107 0.086025
qa: -0.0755 -0.0656 -0.3427 -0.0392 -0.3063 0.2275 -0.1311 -0.0378 -0.0161 -0.1156 -0.1246 0.0371 0.0670 -0.1432 -0.1506 0.0996 -0.1025 -0.1671 -0.1999 0.0984 0.1160 0.1153 0.1409 0.1394 0.1304 0.0930 0.0901 0.1160 0.1285 0.1244 0.1023 0.1061 0.0860
va: 1.2561 1.2389 1.9729 3.2811 3.1326 3.7725 3.9101 3.4621 3.9805 3.8842 3.8860 4.0487 3.8914 4.0779 4.0820 3.9222 4.0587 3.8780 3.9732 1.0082 1.0126 1.0085 1.0171 1.0009 1.0167 1.0015 0.9932 1.0223 1.0102 1.0107 1.0085 1.0087 1.0175
dispcorr: -0.018228906 hartree
energy: -1647.099578303722
dipole: -15.67629 16.15167 0.47538 18.49025 -17.38316 1.10708 8.18247 -9.19125 -1.00878
magnitude: 1.57139 au
magnitude: 3.99415 debye
