program: Orca
programVersion: 4.2.1
elementType: Cl Cl O N N C C C C C C C C C C C C C C H H H H H H H H H H H H H H
charge: 0
multiplicity: 1
keywords: wb97x-d3
keywords: def2-TZVPP
keywords: def2/J RIJCOSX GRIDX6 NOFINALGRIDX
keywords: grid4 nofinalgrid
keywords: scfconv7
keywords: smallprint printgap noloewdin
keywords: NOSOSCF
formula: C14H14Cl2N2O
InChI: InChI=1S/C14H14Cl2N2O/c1-2-7-19-14(9-18-6-5-17-10-18)12-4-3-11(15)8-13(12)16/h2-6,8,10,14H,1,7,9H2
33 atoms
Cl -0.287032 -0.320433 -2.075636
Cl 4.118837 -1.929634 0.477429
O  -0.816399 2.496341 1.197503
N  -2.404423 -0.728782 0.649538
N  -2.301219 -2.849873 0.050688
C  -0.981933 1.283125 0.511935
C  -2.055987 0.512257 1.28804
C  0.305737 0.491268 0.449089
C  0.689314 -0.266646 -0.651807
C  1.145318 0.475193 1.560306
C  -3.331827 -0.901487 -0.342958
C  -1.811464 -1.934839 0.835663
C  -0.03517 3.456673 0.510994
C  1.858341 -1.015001 -0.652695
C  2.315862 -0.259558 1.586903
C  2.664001 -1.004482 0.470694
C  -3.251037 -2.216659 -0.693157
C  -0.68411 3.932239 -0.751478
C  -0.15713 3.762736 -1.956412
H  -1.353118 1.458656 -0.504411
H  -1.707355 0.305011 2.301576
H  -2.949915 1.131274 1.374968
H  0.875328 1.064031 2.427961
H  -3.951388 -0.094527 -0.696551
H  -1.030546 -2.080615 1.567515
H  0.082605 4.285948 1.211781
H  0.968098 3.070095 0.291365
H  2.128768 -1.600619 -1.519535
H  2.950508 -0.2539 2.461702
H  -3.830469 -2.740487 -1.436545
H  -1.641449 4.43346 -0.645518
H  -0.646454 4.125306 -2.850028
H  0.789267 3.253873 -2.095392
totalener: -1647.08173021 hartree
nucrepener: 1706.20430158 hartree
electener: -3353.28603179 hartree
oneelecener: -5648.81585533 hartree
twoeener: 2295.52982354 hartree
kineticenergy: 1642.62837886 hartree
xcener: -113.425167279533 hartree
chargesum: 0.0000000
charge: -0.057144 -0.064587 -0.333328 -0.033959 -0.295888 0.220257 -0.128036 -0.051367 0.030986 -0.182818 -0.126709 0.014626 0.056297 -0.112146 -0.148320 0.089771 -0.096527 -0.192326 -0.187935 0.101427 0.119620 0.108997 0.133036 0.138979 0.131322 0.099622 0.081138 0.116930 0.126632 0.122359 0.115821 0.109952 0.093316
qa: -0.0571 -0.0646 -0.3333 -0.0340 -0.2959 0.2203 -0.1280 -0.0514 0.0310 -0.1828 -0.1267 0.0146 0.0563 -0.1121 -0.1483 0.0898 -0.0965 -0.1923 -0.1879 0.1014 0.1196 0.1090 0.1330 0.1390 0.1313 0.0996 0.0811 0.1169 0.1266 0.1224 0.1158 0.1100 0.0933
va: 1.2634 1.2404 1.9949 3.2659 3.1328 3.7471 3.8705 3.4397 3.9483 3.9533 3.8927 4.0705 3.9415 4.0540 4.0500 3.9426 4.0614 3.8212 3.9317 1.0212 1.0023 1.0167 1.0266 1.0044 1.0032 0.9921 0.9952 1.0218 1.0116 1.0101 1.0096 1.0086 1.0152
dispcorr: -0.019358933 hartree
energy: -1647.101089146096
dipole: -14.18515 14.24594 0.06078 18.29971 -16.47731 1.82240 3.93123 -3.62538 0.30585
magnitude: 1.84889 au
magnitude: 4.69951 debye
