program: Orca
programVersion: 4.2.1
elementType: Cl Cl O N N C C C C C C C C C C C C C C H H H H H H H H H H H H H H
charge: 0
multiplicity: 1
keywords: wb97x-d3
keywords: def2-TZVPP
keywords: def2/J RIJCOSX GRIDX6 NOFINALGRIDX
keywords: grid4 nofinalgrid
keywords: scfconv7
keywords: smallprint printgap noloewdin
keywords: NOSOSCF
formula: C14H14Cl2N2O
InChI: InChI=1S/C14H14Cl2N2O/c1-2-7-19-14(9-18-6-5-17-10-18)12-4-3-11(15)8-13(12)16/h2-6,8,10,14H,1,7,9H2
33 atoms
Cl -0.610869 -1.016453 -2.079301
Cl 4.078706 -1.922315 0.310012
O  -0.883611 2.52566 0.478529
N  -2.39878 -0.768144 0.777624
N  -3.411062 -2.495065 -0.151254
C  -1.070418 1.200641 0.06806
C  -2.07311 0.602378 1.064374
C  0.226421 0.421192 0.069274
C  0.510987 -0.595887 -0.835544
C  1.177115 0.69251 1.049837
C  -1.709773 -1.884208 1.17228
C  -3.40579 -1.201197 -0.021696
C  -0.234113 3.340597 -0.474692
C  1.69198 -1.321239 -0.770169
C  2.362072 -0.014583 1.137927
C  2.609592 -1.023911 0.220733
C  -2.353099 -2.934457 0.586583
C  -0.153405 4.728893 0.065078
C  0.966852 5.434365 0.119128
H  -1.515683 1.167214 -0.936173
H  -1.667477 0.672232 2.075145
H  -2.989968 1.193385 1.042963
H  0.984138 1.487659 1.758985
H  -0.847405 -1.831046 1.815273
H  -4.11121 -0.517753 -0.471603
H  0.769987 2.965139 -0.708782
H  -0.804342 3.336703 -1.415773
H  1.885938 -2.110034 -1.482792
H  3.084621 0.215774 1.908021
H  -2.112959 -3.98276 0.66479
H  -1.087661 5.167358 0.400867
H  0.978841 6.452111 0.483946
H  1.916403 5.025606 -0.204758
totalener: -1647.08132376 hartree
nucrepener: 1679.83633212 hartree
electener: -3326.91765588 hartree
oneelecener: -5595.83793488 hartree
twoeener: 2268.92027900 hartree
kineticenergy: 1642.62600115 hartree
xcener: -113.423194867086 hartree
chargesum: 0.0000000
charge: -0.051113 -0.065008 -0.332089 -0.037226 -0.297228 0.199361 -0.124991 -0.041614 0.023872 -0.171667 -0.134739 0.021512 0.060154 -0.113931 -0.148971 0.084397 -0.097425 -0.158000 -0.205802 0.099232 0.119661 0.109391 0.136754 0.149330 0.124192 0.087660 0.089075 0.117452 0.128150 0.124051 0.110566 0.106366 0.088627
qa: -0.0511 -0.0650 -0.3321 -0.0372 -0.2972 0.1994 -0.1250 -0.0416 0.0239 -0.1717 -0.1347 0.0215 0.0602 -0.1139 -0.1490 0.0844 -0.0974 -0.1580 -0.2058 0.0992 0.1197 0.1094 0.1368 0.1493 0.1242 0.0877 0.0891 0.1175 0.1282 0.1241 0.1106 0.1064 0.0886
va: 1.2771 1.2405 1.9796 3.2656 3.1335 3.8091 3.8641 3.4284 3.9662 3.9504 3.8940 4.0702 3.8877 4.0354 4.0448 3.9388 4.0651 3.8949 3.9661 1.0205 1.0032 1.0160 1.0260 0.9972 1.0063 0.9930 0.9926 1.0210 1.0114 1.0111 1.0128 1.0087 1.0150
dispcorr: -0.018126243 hartree
energy: -1647.099450000113
dipole: -10.03031 10.71516 0.68484 22.03942 -20.43103 1.60839 7.00620 -6.55561 0.45059
magnitude: 1.80525 au
magnitude: 4.58859 debye
