program: Orca
programVersion: 4.2.1
elementType: Cl Cl O N N C C C C C C C C C C C C C C H H H H H H H H H H H H H H
charge: 0
multiplicity: 1
keywords: wb97x-d3
keywords: def2-TZVPP
keywords: def2/J RIJCOSX GRIDX6 NOFINALGRIDX
keywords: grid4 nofinalgrid
keywords: scfconv7
keywords: smallprint printgap noloewdin
keywords: NOSOSCF
formula: C14H14Cl2N2O
InChI: InChI=1S/C14H14Cl2N2O/c1-2-7-19-14(9-18-6-5-17-10-18)12-4-3-11(15)8-13(12)16/h2-6,8,10,14H,1,7,9H2
33 atoms
Cl 0.458239 -0.135974 -3.245879
Cl 3.953971 -2.192357 0.241779
O  -1.209432 2.042234 0.195613
N  -2.402972 -0.557831 0.344408
N  -2.948661 -0.989276 2.438054
C  -0.981156 1.104608 -0.814749
C  -2.208262 0.190642 -0.868006
C  0.279862 0.304365 -0.57188
C  0.986571 -0.305649 -1.601741
C  0.740244 0.102097 0.7261
C  -1.921545 -1.809512 0.624345
C  -3.00405 -0.11344 1.476869
C  -0.371944 3.167017 0.149641
C  2.117031 -1.073058 -1.368597
C  1.864055 -0.659492 0.989745
C  2.548923 -1.240978 -0.064651
C  -2.273518 -2.054049 1.918702
C  -0.488735 3.964119 1.404219
C  -1.180062 3.62577 2.482827
H  -0.913572 1.601295 -1.793457
H  -3.094795 0.798111 -1.057733
H  -2.107772 -0.502721 -1.702942
H  0.202913 0.548409 1.552503
H  -1.385251 -2.394805 -0.10351
H  -3.473575 0.856906 1.529915
H  0.680448 2.87684 0.013267
H  -0.627229 3.799886 -0.714217
H  2.648866 -1.529784 -2.190923
H  2.198864 -0.804485 2.006907
H  -2.081279 -2.941553 2.500216
H  0.068169 4.895528 1.392992
H  -1.193605 4.267541 3.352557
H  -1.745138 2.706474 2.549586
totalener: -1647.08376120 hartree
nucrepener: 1686.89289996 hartree
electener: -3333.97666116 hartree
oneelecener: -5609.86044345 hartree
twoeener: 2275.88378229 hartree
kineticenergy: 1642.62066527 hartree
xcener: -113.425978973234 hartree
chargesum: 0.0000000
charge: -0.073247 -0.065226 -0.333575 -0.032401 -0.310500 0.204960 -0.126448 -0.030737 -0.017541 -0.101719 -0.131187 0.037311 0.052998 -0.145808 -0.153966 0.100836 -0.100796 -0.150396 -0.232962 0.097923 0.112920 0.117943 0.139182 0.143716 0.129617 0.094209 0.085815 0.116338 0.128711 0.124437 0.105409 0.105230 0.108955
qa: -0.0732 -0.0652 -0.3336 -0.0324 -0.3105 0.2050 -0.1264 -0.0307 -0.0175 -0.1017 -0.1312 0.0373 0.0530 -0.1458 -0.1540 0.1008 -0.1008 -0.1504 -0.2330 0.0979 0.1129 0.1179 0.1392 0.1437 0.1296 0.0942 0.0858 0.1163 0.1287 0.1244 0.1054 0.1052 0.1090
va: 1.2591 1.2394 1.9952 3.2773 3.1276 3.8112 3.9023 3.4121 3.9805 3.8751 3.8891 4.0425 3.9313 4.0758 4.0844 3.9164 4.0620 3.8484 3.9833 1.0151 1.0120 1.0108 1.0116 0.9988 1.0112 0.9792 0.9942 1.0222 1.0099 1.0106 1.0083 1.0109 1.0104
dispcorr: -0.018816710 hartree
energy: -1647.102577907213
dipole: -16.28026 16.75455 0.47429 16.26340 -15.44323 0.82017 11.04354 -12.27469 -1.23115
magnitude: 1.55350 au
magnitude: 3.94868 debye
