program: Orca
programVersion: 4.2.1
elementType: Cl Cl O N N C C C C C C C C C C C C C C H H H H H H H H H H H H H H
charge: 0
multiplicity: 1
keywords: wb97x-d3
keywords: def2-TZVPP
keywords: def2/J RIJCOSX GRIDX6 NOFINALGRIDX
keywords: grid4 nofinalgrid
keywords: scfconv7
keywords: smallprint printgap noloewdin
keywords: NOSOSCF
formula: C14H14Cl2N2O
InChI: InChI=1S/C14H14Cl2N2O/c1-2-7-19-14(9-18-6-5-17-10-18)12-4-3-11(15)8-13(12)16/h2-6,8,10,14H,1,7,9H2
33 atoms
Cl 0.494429 -1.0737 -2.214016
Cl 5.187638 -0.480735 0.285538
O  -1.23324 1.124435 1.183258
N  -2.878335 -1.166449 0.619916
N  -4.99142 -0.709006 1.055274
C  -0.810766 0.12476 0.299639
C  -1.44712 -1.189488 0.757762
C  0.694219 -0.013969 0.275923
C  1.371607 -0.554695 -0.811207
C  1.455613 0.362252 1.377232
C  -3.587766 -1.487542 -0.506923
C  -3.774962 -0.693708 1.51938
C  -1.504046 2.372318 0.574407
C  2.749324 -0.701496 -0.824578
C  2.832165 0.222741 1.396244
C  3.472076 -0.306633 0.287567
C  -4.88844 -1.201896 -0.210999
C  -0.296856 3.002274 -0.047287
C  -0.215882 3.320334 -1.33178
H  -1.167653 0.334884 -0.717379
H  -1.049195 -2.021164 0.175794
H  -1.18831 -1.375667 1.801828
H  0.956477 0.786626 2.237854
H  -3.113554 -1.891416 -1.385962
H  -3.475238 -0.355261 2.499286
H  -2.299415 2.267588 -0.175064
H  -1.894664 3.004708 1.374643
H  3.247722 -1.115685 -1.689364
H  3.402015 0.524863 2.263565
H  -5.754418 -1.333798 -0.840066
H  0.543307 3.201524 0.610385
H  0.665263 3.788735 -1.747984
H  -1.032916 3.129911 -2.017561
totalener: -1647.08386122 hartree
nucrepener: 1654.78231197 hartree
electener: -3301.86617319 hartree
oneelecener: -5545.57310952 hartree
twoeener: 2243.70693633 hartree
kineticenergy: 1642.62788180 hartree
xcener: -113.422672906055 hartree
chargesum: -0.0000000
charge: -0.073573 -0.066164 -0.348399 -0.031064 -0.310912 0.230801 -0.155948 0.051896 -0.036894 -0.202831 -0.124370 0.040471 0.044175 -0.126587 -0.132042 0.085059 -0.110202 -0.147603 -0.200164 0.098978 0.127069 0.123974 0.136837 0.142743 0.127052 0.084396 0.091569 0.115823 0.127219 0.123514 0.114873 0.109202 0.091103
qa: -0.0736 -0.0662 -0.3484 -0.0311 -0.3109 0.2308 -0.1559 0.0519 -0.0369 -0.2028 -0.1244 0.0405 0.0442 -0.1266 -0.1320 0.0851 -0.1102 -0.1476 -0.2002 0.0990 0.1271 0.1240 0.1368 0.1427 0.1271 0.0844 0.0916 0.1158 0.1272 0.1235 0.1149 0.1092 0.0911
va: 1.2571 1.2391 1.9580 3.2806 3.1313 3.7115 3.8623 3.4661 4.0169 3.9754 3.8853 4.0555 3.9351 4.0474 4.0279 3.9403 4.0793 3.8015 3.9499 1.0156 1.0142 1.0096 1.0291 1.0051 1.0130 0.9980 0.9956 1.0221 1.0113 1.0103 1.0079 1.0091 1.0138
dispcorr: -0.017842690 hartree
energy: -1647.101703907014
dipole: -19.51185 20.81883 1.30698 11.02383 -10.68816 0.33567 4.52146 -4.76212 -0.24066
magnitude: 1.37069 au
magnitude: 3.48401 debye
