program: Orca
programVersion: 4.2.1
elementType: Cl Cl O N N C C C C C C C C C C C C C C H H H H H H H H H H H H H H
charge: 0
multiplicity: 1
keywords: wb97x-d3
keywords: def2-TZVPP
keywords: def2/J RIJCOSX GRIDX6 NOFINALGRIDX
keywords: grid4 nofinalgrid
keywords: scfconv7
keywords: smallprint printgap noloewdin
keywords: NOSOSCF
formula: C14H14Cl2N2O
InChI: InChI=1S/C14H14Cl2N2O/c1-2-7-19-14(9-18-6-5-17-10-18)12-4-3-11(15)8-13(12)16/h2-6,8,10,14H,1,7,9H2
33 atoms
Cl 0.736911 -1.209669 -2.057741
Cl 5.259721 -0.763487 0.764066
O  -1.06993 1.328162 1.069321
N  -2.854733 -0.818706 0.413342
N  -4.749703 -0.837832 -0.717921
C  -0.658982 0.272829 0.247627
C  -1.447216 -0.966522 0.673503
C  0.828594 0.020692 0.360235
C  1.542705 -0.650033 -0.628148
C  1.5341 0.431933 1.486149
C  -3.779598 -0.179009 1.192474
C  -3.495148 -1.183252 -0.725503
C  -1.037595 2.604018 0.457176
C  2.901307 -0.898037 -0.518216
C  2.891327 0.198484 1.624514
C  3.567892 -0.466394 0.61549
C  -4.940794 -0.208088 0.476088
C  -2.055893 2.733506 -0.63203
C  -1.767581 3.122798 -1.866281
H  -0.907094 0.479504 -0.801848
H  -1.08469 -1.841164 0.132994
H  -1.289801 -1.157459 1.736645
H  1.005538 0.95637 2.270485
H  -3.535415 0.22629 2.158837
H  -2.986072 -1.707555 -1.521195
H  -1.251725 3.31334 1.259931
H  -0.035612 2.840105 0.074512
H  3.428885 -1.417007 -1.305639
H  3.417885 0.531567 2.507644
H  -5.904784 0.181796 0.762061
H  -3.079215 2.488931 -0.362642
H  -2.533039 3.224252 -2.623066
H  -0.753956 3.360911 -2.167048
totalener: -1647.08514447 hartree
nucrepener: 1649.10968573 hartree
electener: -3296.19483020 hartree
oneelecener: -5534.25784438 hartree
twoeener: 2238.06301418 hartree
kineticenergy: 1642.62144283 hartree
xcener: -113.421602425410 hartree
chargesum: -0.0000000
charge: -0.069612 -0.065149 -0.343518 -0.014286 -0.304640 0.221996 -0.152986 0.007830 -0.044027 -0.163973 -0.136058 0.030133 0.061843 -0.128884 -0.141576 0.090846 -0.107892 -0.176244 -0.200225 0.109589 0.128039 0.123801 0.133420 0.142902 0.123726 0.094465 0.081208 0.116844 0.126735 0.123974 0.127908 0.113321 0.090489
qa: -0.0696 -0.0651 -0.3435 -0.0143 -0.3046 0.2220 -0.1530 0.0078 -0.0440 -0.1640 -0.1361 0.0301 0.0618 -0.1289 -0.1416 0.0908 -0.1079 -0.1762 -0.2002 0.1096 0.1280 0.1238 0.1334 0.1429 0.1237 0.0945 0.0812 0.1168 0.1267 0.1240 0.1279 0.1133 0.0905
va: 1.2624 1.2399 1.9660 3.2725 3.1358 3.7163 3.8387 3.4952 4.0427 3.9853 3.9024 4.0503 3.9301 4.0444 4.0332 3.9340 4.0513 3.8299 3.9587 1.0110 1.0163 1.0094 1.0300 1.0120 1.0097 0.9895 0.9965 1.0223 1.0123 1.0109 1.0117 1.0087 1.0113
dispcorr: -0.017767252 hartree
energy: -1647.102911725987
dipole: -22.73652 23.91683 1.18031 13.50972 -12.91758 0.59214 3.65983 -3.00209 0.65774
magnitude: 1.47526 au
magnitude: 3.74982 debye
