program: Orca
programVersion: 4.2.1
elementType: Cl Cl O N N C C C C C C C C C C C C C C H H H H H H H H H H H H H H
charge: 0
multiplicity: 1
keywords: wb97x-d3
keywords: def2-TZVPP
keywords: def2/J RIJCOSX GRIDX6 NOFINALGRIDX
keywords: grid4 nofinalgrid
keywords: scfconv7
keywords: smallprint printgap noloewdin
keywords: NOSOSCF
formula: C14H14Cl2N2O
InChI: InChI=1S/C14H14Cl2N2O/c1-2-7-19-14(9-18-6-5-17-10-18)12-4-3-11(15)8-13(12)16/h2-6,8,10,14H,1,7,9H2
33 atoms
Cl -0.167449 -0.596327 -2.073144
Cl 4.085244 -2.228137 0.713338
O  -0.545199 2.560132 0.933446
N  -2.339911 -0.582944 0.535808
N  -2.371951 -2.74796 0.112815
C  -0.771317 1.320616 0.310686
C  -1.927558 0.6787 1.088201
C  0.461364 0.444059 0.356931
C  0.79758 -0.457103 -0.648158
C  1.286817 0.489533 1.477783
C  -3.260683 -0.774145 -0.459482
C  -1.834938 -1.806788 0.833108
C  0.22061 3.45871 0.17168
C  1.908269 -1.282908 -0.547676
C  2.400504 -0.320153 1.603121
C  2.702868 -1.206564 0.581228
C  -3.264253 -2.116057 -0.700231
C  -0.55989 4.190995 -0.87717
C  -1.880652 4.226392 -0.978918
H  -1.086895 1.45993 -0.730367
H  -1.632081 0.53263 2.129135
H  -2.779871 1.35968 1.089309
H  1.052089 1.186005 2.272511
H  -3.816492 0.040902 -0.891841
H  -1.079748 -1.944177 1.593119
H  0.645719 4.182646 0.873965
H  1.077841 2.95468 -0.295976
H  2.14254 -1.977973 -1.341072
H  3.025691 -0.2642 2.482964
H  -3.865462 -2.659342 -1.411686
H  0.045176 4.74492 -1.588433
H  -2.365521 4.790699 -1.762849
H  -2.527984 3.705031 -0.285909
totalener: -1647.08060737 hartree
nucrepener: 1697.83850997 hartree
electener: -3344.91911734 hartree
oneelecener: -5631.98154023 hartree
twoeener: 2287.06242289 hartree
kineticenergy: 1642.62009167 hartree
xcener: -113.425454275627 hartree
chargesum: -0.0000000
charge: -0.054105 -0.064407 -0.347677 -0.036080 -0.294521 0.197152 -0.115884 -0.086018 0.038429 -0.163717 -0.124750 0.011282 0.080567 -0.109834 -0.156700 0.091555 -0.095331 -0.165726 -0.225359 0.126084 0.122586 0.105398 0.132944 0.137962 0.133359 0.100642 0.085991 0.116278 0.126314 0.122993 0.105119 0.108317 0.097136
qa: -0.0541 -0.0644 -0.3477 -0.0361 -0.2945 0.1972 -0.1159 -0.0860 0.0384 -0.1637 -0.1248 0.0113 0.0806 -0.1098 -0.1567 0.0916 -0.0953 -0.1657 -0.2254 0.1261 0.1226 0.1054 0.1329 0.1380 0.1334 0.1006 0.0860 0.1163 0.1263 0.1230 0.1051 0.1083 0.0971
va: 1.2729 1.2408 1.9635 3.2620 3.1319 3.7259 3.8757 3.5108 3.9703 3.9634 3.8923 4.0725 3.9177 4.0518 4.0547 3.9336 4.0578 3.8468 3.9658 1.0022 1.0031 1.0154 1.0270 1.0051 1.0024 0.9910 0.9913 1.0219 1.0122 1.0101 1.0099 1.0087 1.0176
dispcorr: -0.018960844 hartree
energy: -1647.099568214711
dipole: -16.05719 16.28292 0.22573 20.99109 -19.15553 1.83557 3.68427 -3.45694 0.22733
magnitude: 1.86332 au
magnitude: 4.73617 debye
