program: Orca
programVersion: 4.2.1
elementType: Cl Cl O N N C C C C C C C C C C C C C C C C C H H H H H H H H H H H H
charge: 0
multiplicity: 1
keywords: wb97x-d3
keywords: def2-TZVPP
keywords: def2/J RIJCOSX GRIDX6 NOFINALGRIDX
keywords: grid4 nofinalgrid
keywords: scfconv7
keywords: smallprint printgap noloewdin
keywords: NOSOSCF
formula: C17H12Cl2N2O
InChI: InChI=1S/C17H12Cl2N2O/c18-14-7-5-12(6-8-14)17(22,13-9-20-11-21-10-13)15-3-1-2-4-16(15)19/h1-11,22H
34 atoms
Cl 0.680547 0.407694 -2.215065
Cl -5.381184 0.191749 0.118263
O  0.738951 -0.107242 2.312673
N  1.386026 -3.316751 -0.876318
N  3.215335 -2.702335 0.486084
C  0.594918 -0.049214 0.907979
C  -0.899452 0.017832 0.612314
C  1.38525 1.132149 0.328619
C  1.273122 -1.321422 0.415771
C  -1.705309 -1.050183 1.007256
C  -1.51437 1.153346 0.101026
C  1.501215 1.385034 -1.040402
C  2.084431 1.979921 1.184503
C  0.734421 -2.228114 -0.481557
C  2.551892 -1.620287 0.868752
C  -3.079663 -1.009442 0.85206
C  -2.892221 1.216361 -0.051611
C  2.266704 2.431497 -1.53183
C  2.853069 3.03123 0.708071
C  -3.663215 0.128828 0.316956
C  2.946973 3.259211 -0.654173
C  2.59318 -3.498653 -0.370283
H  -1.266866 -1.937142 1.44725
H  -0.934359 2.022125 -0.17868
H  2.043325 1.815946 2.251365
H  0.219531 0.602417 2.710329
H  -0.252204 -2.087625 -0.903416
H  3.068383 -0.96422 1.559673
H  -3.684833 -1.85347 1.152912
H  -3.350443 2.109628 -0.453223
H  2.330301 2.596676 -2.598651
H  3.380693 3.665581 1.407066
H  3.545378 4.073038 -1.040183
H  3.127472 -4.385082 -0.687922
elementType: Cl O N C H
totalener: -1760.23741932 hartree
nucrepener: 2018.66644231 hartree
electener: -3778.90386163 hartree
oneelecener: -6424.36129412 hartree
twoeener: 2645.45743249 hartree
cpcmener: -0.02768937 hartree
kineticenergy: 1755.35901488 hartree
xcener: -124.324977811159 hartree
chargesum: 0.0000000
charge: -0.085282 -0.096119 -0.383588 -0.359028 -0.363722 0.831019 -0.120692 -0.054663 -0.130587 -0.290575 -0.142985 -0.082269 -0.144269 0.050544 -0.016938 -0.158334 -0.168943 -0.130549 -0.169720 0.116936 -0.152501 0.185035 0.154646 0.162242 0.140971 0.223654 0.146537 0.134737 0.147067 0.144940 0.141086 0.163072 0.165268 0.143011
qa: -0.0853 -0.0961 -0.3836 -0.3590 -0.3637 0.8310 -0.1207 -0.0547 -0.1306 -0.2906 -0.1430 -0.0823 -0.1443 0.0505 -0.0169 -0.1583 -0.1689 -0.1305 -0.1697 0.1169 -0.1525 0.1850 0.1546 0.1622 0.1410 0.2237 0.1465 0.1347 0.1471 0.1449 0.1411 0.1631 0.1653 0.1430
va: 1.2409 1.2098 2.0403 3.0571 3.0369 3.2169 3.6140 3.3906 3.6137 4.1084 3.9087 3.9442 3.8913 4.0217 4.1449 4.0138 4.0469 3.9839 3.9411 3.8171 3.9283 4.0059 1.0072 0.9915 1.0340 1.0086 1.0128 1.0244 1.0056 1.0075 1.0084 0.9910 0.9866 0.9943
dispcorr: -0.020090987 hartree
energy: -1760.257510304147
dipole: 14.00194 -13.85197 0.14997 4.45626 -2.24732 2.20894 7.22399 -6.49512 0.72887
magnitude: 2.33091 au
magnitude: 5.92471 debye
