program: Orca
programVersion: 4.2.1
elementType: Cl Cl O N N C C C C C C C C C C C C C C C C C H H H H H H H H H H H H
charge: 0
multiplicity: 1
keywords: wb97x-d3
keywords: def2-TZVPP
keywords: def2/J RIJCOSX GRIDX6 NOFINALGRIDX
keywords: grid4 nofinalgrid
keywords: scfconv7
keywords: smallprint printgap noloewdin
keywords: NOSOSCF
formula: C17H12Cl2N2O
InChI: InChI=1S/C17H12Cl2N2O/c18-14-7-5-12(6-8-14)17(22,13-9-20-11-21-10-13)15-3-1-2-4-16(15)19/h1-11,22H
34 atoms
Cl 0.021805 0.909311 -2.05438
Cl -5.216871 0.195058 0.110182
O  0.959821 -0.032362 2.28668
N  1.858016 -3.730728 0.803453
N  2.598261 -2.720207 -1.197453
C  0.756446 -0.127554 0.888964
C  -0.748713 -0.082917 0.640558
C  1.477471 1.07535 0.270622
C  1.388113 -1.426323 0.397221
C  -1.462306 -1.140149 0.094515
C  -1.443112 1.056847 1.041971
C  1.20793 1.603527 -0.993277
C  2.507573 1.676389 0.995804
C  1.326479 -2.574928 1.177303
C  2.064927 -1.568922 -0.803918
C  -2.838182 -1.063921 -0.068157
C  -2.813595 1.151999 0.880171
C  1.905431 2.695975 -1.492869
C  3.218652 2.757506 0.503212
C  -3.502017 0.084825 0.322617
C  2.910924 3.278786 -0.743018
C  2.463168 -3.744983 -0.373943
H  -0.962207 -2.038494 -0.239866
H  -0.915659 1.898737 1.472649
H  2.769862 1.291879 1.969802
H  0.215704 -0.439888 2.743545
H  0.83473 -2.575503 2.142476
H  2.208693 -0.736029 -1.478327
H  -3.377052 -1.894629 -0.502299
H  -3.335592 2.0482 1.185853
H  1.662475 3.083027 -2.47275
H  4.010391 3.19083 1.098869
H  3.451656 4.127664 -1.138391
H  2.893524 -4.686709 -0.690368
elementType: Cl O N C H
totalener: -1760.23452894 hartree
nucrepener: 2020.29920784 hartree
electener: -3780.53373677 hartree
oneelecener: -6427.60441262 hartree
twoeener: 2647.07067584 hartree
cpcmener: -0.02650107 hartree
kineticenergy: 1755.35959066 hartree
xcener: -124.323859236818 hartree
chargesum: 0.0000000
charge: -0.084861 -0.097172 -0.389871 -0.357826 -0.359719 0.817986 -0.250991 -0.005840 -0.235737 -0.052960 -0.223687 -0.018862 -0.180997 0.009118 0.055612 -0.171674 -0.168325 -0.132109 -0.170519 0.128982 -0.151146 0.189091 0.157956 0.149165 0.149070 0.229394 0.128520 0.134058 0.144560 0.148389 0.139150 0.163694 0.165357 0.142196
qa: -0.0849 -0.0972 -0.3899 -0.3578 -0.3597 0.8180 -0.2510 -0.0058 -0.2357 -0.0530 -0.2237 -0.0189 -0.1810 0.0091 0.0556 -0.1717 -0.1683 -0.1321 -0.1705 0.1290 -0.1511 0.1891 0.1580 0.1492 0.1491 0.2294 0.1285 0.1341 0.1446 0.1484 0.1392 0.1637 0.1654 0.1422
va: 1.2336 1.2079 2.0116 3.0328 3.0584 3.3020 3.6473 3.3734 3.7858 3.8055 4.0889 3.9113 3.9604 4.1225 4.0619 4.0574 4.0229 3.9897 3.9205 3.7926 3.9208 4.0084 0.9918 1.0036 1.0299 1.0109 1.0288 1.0286 1.0072 1.0038 1.0099 0.9902 0.9865 0.9947
dispcorr: -0.020238724 hartree
energy: -1760.254767660926
dipole: 15.77314 -15.56948 0.20366 1.66733 -0.48825 1.17907 6.50161 -5.82115 0.68047
magnitude: 1.37649 au
magnitude: 3.49877 debye
