program: Orca
programVersion: 4.2.1
elementType: Cl Cl O N N C C C C C C C C C C C C C C C C C H H H H H H H H H H H H
charge: 0
multiplicity: 1
keywords: wb97x-d3
keywords: def2-TZVPP
keywords: def2/J RIJCOSX GRIDX6 NOFINALGRIDX
keywords: grid4 nofinalgrid
keywords: scfconv7
keywords: smallprint printgap noloewdin
keywords: NOSOSCF
formula: C17H12Cl2N2O
InChI: InChI=1S/C17H12Cl2N2O/c18-14-7-5-12(6-8-14)17(22,13-9-20-11-21-10-13)15-3-1-2-4-16(15)19/h1-11,22H
34 atoms
Cl 0.642169 0.555759 -2.236707
Cl -5.315204 0.244295 0.315652
O  0.860728 -0.321498 2.233879
N  1.390896 -3.293869 -1.208738
N  3.211359 -2.870817 0.226551
C  0.681893 -0.166854 0.842061
C  -0.819354 -0.05616 0.596787
C  1.477003 1.04114 0.324064
C  1.326067 -1.413139 0.247138
C  -1.630971 -1.14945 0.898932
C  -1.431613 1.139613 0.244125
C  1.537561 1.409916 -1.02192
C  2.237567 1.795143 1.215118
C  0.769948 -2.221407 -0.731889
C  2.585808 -1.799937 0.691125
C  -3.009425 -1.069775 0.804558
C  -2.812859 1.241466 0.157236
C  2.306595 2.47911 -1.456371
C  3.010661 2.86689 0.795802
C  -3.59167 0.131265 0.429737
C  3.047193 3.212047 -0.544344
C  2.580036 -3.568169 -0.704832
H  -1.194974 -2.086847 1.220504
H  -0.845226 2.025427 0.040305
H  2.240409 1.537359 2.264294
H  0.34205 0.349021 2.695616
H  -0.207208 -2.01392 -1.149375
H  3.113273 -1.22965 1.447584
H  -3.618941 -1.933689 1.031927
H  -3.268108 2.182366 -0.119706
H  2.326221 2.735906 -2.506961
H  3.585848 3.425976 1.521568
H  3.647554 4.044177 -0.886874
H  3.087904 -4.444352 -1.090737
elementType: Cl O N C H
totalener: -1760.24379555 hartree
nucrepener: 2016.81239140 hartree
electener: -3777.05618695 hartree
oneelecener: -6420.60574268 hartree
twoeener: 2643.54955572 hartree
cpcmener: -0.02391823 hartree
kineticenergy: 1755.34988393 hartree
xcener: -124.322973266368 hartree
chargesum: 0.0000000
charge: -0.082697 -0.093877 -0.366860 -0.352517 -0.356691 0.788851 -0.113625 -0.049856 -0.107952 -0.281163 -0.143935 -0.078852 -0.150021 0.040809 -0.018323 -0.157682 -0.165902 -0.128330 -0.167824 0.116559 -0.149724 0.181480 0.153143 0.160033 0.140943 0.216277 0.145709 0.131388 0.144508 0.143275 0.139910 0.159709 0.161799 0.141438
qa: -0.0827 -0.0939 -0.3669 -0.3525 -0.3567 0.7889 -0.1136 -0.0499 -0.1080 -0.2812 -0.1439 -0.0789 -0.1500 0.0408 -0.0183 -0.1577 -0.1659 -0.1283 -0.1678 0.1166 -0.1497 0.1815 0.1531 0.1600 0.1409 0.2163 0.1457 0.1314 0.1445 0.1433 0.1399 0.1597 0.1618 0.1414
va: 1.2435 1.2119 2.0548 3.0638 3.0406 3.2782 3.6255 3.3925 3.5802 4.1075 3.9122 3.9545 3.9000 4.0328 4.1490 4.0149 4.0482 3.9846 3.9496 3.8286 3.9333 4.0096 1.0065 0.9925 1.0353 1.0154 1.0117 1.0251 1.0063 1.0077 1.0086 0.9922 0.9880 0.9941
dispcorr: -0.020038972 hartree
energy: -1760.263834526621
dipole: 14.40167 -14.20003 0.20165 3.50684 -1.46318 2.04366 7.00940 -6.17229 0.83711
magnitude: 2.21765 au
magnitude: 5.63682 debye
