program: Gaussian 09
title: 000034483
version: EM64L-G09RevD.01
frameworkgroup: C1[X(C21H27NO2S)]
method: RPBEPBE
basis: SDD
operation: Freq
keyword: #p
keyword: freq=noraman
keyword: PBEPBE/SDD
title: #p freq=noraman PBEPBE/SDD
converged: YES YES NO NO
title: Mulliken charges:
elementType: S O O N C C C C C C C C C C C C C C C C C C C C C H H H H H H H H H H H H H H H H H H H H H H H H H H H
charge: 0.875240 -0.533636 -0.537601 -0.076822 -0.300558 -0.240745 0.315470 0.412908 -0.455813 0.415891 -0.680236 -0.700668 -0.393740 -0.348459 -0.404036 -0.335250 -0.388529 -0.361369 -0.263688 -0.253912 -0.247147 -0.250209 -0.240354 -0.626442 -0.616367 0.227796 0.254504 0.218699 0.273599 0.231217 0.212052 0.274446 0.243435 0.228274 0.239650 0.268561 0.240022 0.253621 0.245162 0.176656 0.214902 0.236411 0.233404 0.228940 0.227584 0.231613 0.233216 0.185768 0.220656 0.226033 0.221794 0.188061
chargesum: 0.00000
title: Mulliken charges with hydrogens summed into heavy atoms:
elementType: S O O N C C C C C C C C C C C C C C C C C C C C C
charge: 0.875240 -0.533636 -0.537601 -0.076822 -0.300558 -0.240745 0.315470 0.412908 0.026487 0.415891 0.043279 0.029265 0.074184 -0.079899 -0.164014 -0.081629 -0.143367 0.030189 -0.027278 -0.020509 -0.018207 -0.022625 -0.008741 0.013198 0.019521
polarizability: 2.73263648e+02 3.53214860e+01 2.89238904e+02 -3.68334968e+00 4.20548979e+00 2.46494798e+02
1716.lowfreq: -7.3332 -5.2646 -3.6857 -0.0010 0.0006 0.0008 19.5257 22.7718 37.4490
frequency: 18.4674 22.1798 37.3679 44.2672 51.2937 63.6809 76.0910 93.6441 115.5113 133.2104 144.1762 146.3976 159.9845 174.0731 177.7111 195.2404 202.7508 216.3399 231.5840 238.6535 240.5473 243.3132 258.8589 271.0432 300.7267 319.9130 332.0331 338.5862 349.2019 372.9019 398.8980 403.3032 412.7456 434.1563 453.4816 469.6234 493.4658 528.6303 548.9676 563.1423 590.7545 608.6190 616.7716 671.3782 689.8781 700.4678 736.0250 755.3971 772.9647 774.3634 787.5840 811.7520 817.7430 825.9871 849.6462 885.8293 903.4897 913.5916 921.0339 932.1010 946.1847 960.6798 981.1578 990.4974 992.8404 996.2995 998.8320 1008.8587 1026.7664 1031.9720 1034.3667 1039.6221 1054.6773 1071.2535 1081.4399 1087.7667 1091.0336 1093.6467 1106.8000 1131.6287 1143.0513 1159.7650 1176.0527 1180.8253 1188.6093 1201.0813 1206.8505 1220.2111 1251.1707 1262.8299 1264.4086 1276.4194 1287.9382 1296.5069 1312.1959 1332.0989 1338.0815 1357.1347 1371.1151 1382.7603 1384.8826 1399.6822 1417.7194 1428.0725 1439.2174 1440.5054 1446.8945 1453.8773 1459.8936 1461.3996 1465.6422 1469.8720 1470.4700 1474.3508 1476.6624 1477.1467 1483.5252 1487.5006 1492.2393 1571.4221 1585.7586 1606.4515 1610.3908 2812.9004 2842.7000 2859.5612 2982.6606 2989.3931 2997.3808 3002.5349 3009.5370 3018.5734 3030.7688 3047.3239 3071.9218 3076.1048 3077.6020 3082.5984 3088.2157 3103.9370 3106.9874 3127.8217 3128.8781 3137.5442 3138.2154 3150.7423 3151.4718 3160.1187 3166.8301 3170.4365
redmass: 2.5492 4.2703 3.7687 5.3078 3.8159 4.7474 4.8417 2.5229 2.5574 1.8376 1.5397 3.8714 3.8102 1.7789 4.3014 3.2618 2.6237 3.3136 1.1102 2.8592 4.3637 1.5883 3.0233 2.9097 3.8674 3.5376 2.5137 2.8125 2.9591 3.7984 10.0485 2.8205 2.7707 7.0276 3.2649 3.6082 3.2944 4.3164 3.5718 3.3535 3.8606 5.1031 6.2963 4.7922 4.2065 1.5577 3.7900 1.3061 1.2989 3.4109 2.4573 7.1541 4.3438 2.0737 1.2540 1.4078 2.0589 3.6538 6.2068 1.4737 1.3604 1.3842 1.3935 5.5100 1.3388 1.3282 1.3475 3.2594 2.6814 2.3494 1.8726 2.6692 2.7644 2.1822 2.1188 1.8189 1.4030 1.6836 1.7336 1.4541 1.7189 1.6506 1.0541 1.0808 4.1170 1.1698 2.1359 2.4249 1.8538 2.1105 2.0386 1.6775 1.6865 1.1985 1.6271 1.4145 1.3662 9.1757 1.3782 7.1019 1.1872 1.1767 1.1432 2.1007 2.2004 1.1890 1.0561 1.0686 1.0622 1.0617 1.4096 1.1575 1.4002 1.0704 1.1568 1.0597 1.1005 1.6322 1.1495 6.4404 5.7756 6.1076 5.9121 1.0701 1.0575 1.0572 1.0373 1.0365 1.0607 1.0706 1.0740 1.0723 1.0716 1.0987 1.1034 1.0981 1.1011 1.0978 1.1003 1.0996 1.0996 1.0848 1.0853 1.0883 1.0890 1.0944 1.0925 1.0953 1.1007 1.1006
irintensity: 0.6912 0.4900 0.0697 2.4338 0.5241 1.8653 0.9500 1.3578 0.2238 0.0628 0.5357 3.2466 7.8940 1.1217 0.4604 0.9970 4.5955 4.2977 1.3018 2.6533 8.2334 1.2404 4.1653 1.2878 1.3760 0.8808 6.1404 4.1755 0.0421 1.7660 11.8076 0.1457 2.2835 33.2581 0.0541 6.6377 8.3812 12.0030 10.3874 1.3990 11.4795 1.3287 0.2165 15.7598 2.7847 61.6333 0.9895 12.1222 51.9268 4.9169 5.5088 43.1797 47.6812 5.0039 2.5026 0.1846 2.9418 20.3808 46.0558 2.0105 0.0798 1.2492 0.9859 0.7156 1.0737 0.5627 0.1207 17.5334 6.6069 11.6238 13.1047 12.8327 14.3833 18.3442 5.0423 3.2195 16.3995 31.7229 9.1850 6.6319 8.9038 13.0488 0.1185 0.0709 2.2803 7.0223 9.4019 0.1398 11.1890 5.9496 4.6803 22.4540 2.5648 11.1324 20.8850 5.0427 2.3971 1.5983 19.2310 1.2504 25.0696 21.2314 2.0672 15.4019 6.5832 5.3289 6.5737 4.0789 9.3724 14.8413 3.3121 6.4479 15.1687 8.7269 31.8683 9.6838 10.9066 11.1798 15.6165 0.9213 0.2165 0.0389 0.2187 66.7646 68.3380 218.6416 15.0586 31.2246 1.1629 3.7891 31.4502 44.0343 41.3246 0.3724 41.7589 2.3279 40.6015 14.4457 50.0208 7.6336 17.1637 0.7507 1.3146 3.6750 6.3205 32.8854 21.2968 26.0640 22.4727 13.8006
temp: 298.150 k
press: 1.00000 atm
elementType: 16 8 8 7 6 6 6 6 6 6 6 6 6 6 6 6 6 6 6 6 6 6 6 6 6 1 1 1 1 1 1 1 1 1 1 1 1 1 1 1 1 1 1 1 1 1 1 1 1 1 1 1
symmnumber: 1
zpe: 1126363.7 jmol-1
zpe.correction: 0.429009 hartree
zpe.thermalcorrener: 0.455267 hartree
zpe.thermalcorrenthalpy: 0.456211 hartree
zpe.thermalcorrgfe: 0.371925 hartree
zpe.sumelectzpe: -1417.675847 hartree
zpe.sumelectthermal: -1417.649590 hartree
zpe.sumelectthermalent: -1417.648646 hartree
zpe.sumelectthermalfe: -1417.732932 hartree
dipole: 2.0657 -2.4613 4.4059
dipole: 5.4531
quadrupole: -148.4344 -146.5479 -165.6062
quadrupole: 16.4900 -13.0378 5.6956
quadrupole: 5.0951 6.9816 -12.0767 16.4900 -13.0378 5.6956
hfenergy: -1418.1048565 hartree
pointgroup: C01 [X(C21H27N1O2S1)]
dipole: -0.6994459 -1.2769232 -1.5757928 debye
polarizability: 282.8972914|-36.4002426|277.9589825|0.9720144|-8.113552|248.1410757 unknown
InChI: InChI=1S/C21H27NO2S/c1-20(2)18-13-8-9-14-19(18)21(25(20,23)24,15-10-16-22(3)4)17-11-6-5-7-12-17/h5-9,11-14H,10,15-16H2,1-4H3
charge 0 multiplicity 1
52 atoms
S  1.739121 0.57161 1.592688
O  2.633567 1.898932 1.254937
O  1.209723 0.348252 3.128253
N  -4.396979 -1.933174 0.403274
C  0.177787 0.337367 0.196588
C  2.72932 -1.071753 0.928765
C  0.901511 -0.551291 -0.802971
C  2.097454 -1.24769 -0.444968
C  -0.88683 -0.416975 1.01828
C  -0.166896 1.727033 -0.261929
C  2.405004 -2.187808 1.932089
C  4.210568 -0.67787 0.913092
C  -2.156902 -0.781901 0.206808
C  0.362945 -0.726852 -2.104057
C  2.710098 -2.105001 -1.393258
C  0.647939 2.386417 -1.223756
C  -1.246367 2.453185 0.314293
C  -3.237109 -1.374783 1.136835
C  0.971378 -1.596532 -3.030819
C  2.148783 -2.292802 -2.67288
C  0.369486 3.707903 -1.625823
C  -1.524821 3.775494 -0.0866
C  -0.721665 4.408396 -1.063209
C  -5.188508 -0.906661 -0.304924
C  -5.248761 -2.767174 1.277013
H  -0.443958 -1.349829 1.41226
H  -1.156232 0.179653 1.911004
H  3.051564 -3.060345 1.717695
H  2.596689 -1.849256 2.965432
H  1.355242 -2.517488 1.871674
H  4.808072 -1.472428 0.428403
H  4.367384 0.267197 0.367109
H  4.589683 -0.54626 1.941358
H  -2.541968 0.116736 -0.308564
H  -1.916343 -1.530411 -0.570041
H  -0.537879 -0.172031 -2.386008
H  3.631892 -2.633604 -1.12648
H  1.509395 1.863774 -1.650736
H  -1.870162 1.991638 1.0858
H  -3.5532 -0.590691 1.877881
H  -2.785929 -2.200195 1.721844
H  0.532849 -1.727872 -4.025757
H  2.629284 -2.969767 -3.387401
H  1.013502 4.197694 -2.364241
H  -2.36211 4.315901 0.36859
H  -0.935544 5.437884 -1.371174
H  -4.565996 -0.38456 -1.050626
H  -5.626198 -0.137203 0.383097
H  -6.020082 -1.393413 -0.844854
H  -4.643431 -3.573394 1.728309
H  -6.049443 -3.236167 0.67731
H  -5.732828 -2.191485 2.107193
