program: Orca
programVersion: 4.2.1
elementType: Cl Cl O N N C C C C C C C C C C C C C C C C C H H H H H H H H H H H H
charge: 0
multiplicity: 1
keywords: wb97x-d3
keywords: def2-TZVPP
keywords: def2/J RIJCOSX GRIDX6 NOFINALGRIDX
keywords: grid4 nofinalgrid
keywords: scfconv7
keywords: smallprint printgap noloewdin
keywords: NOSOSCF
formula: C17H12Cl2N2O
InChI: InChI=1S/C17H12Cl2N2O/c18-14-7-5-12(6-8-14)17(22,13-9-20-11-21-10-13)15-3-1-2-4-16(15)19/h1-11,22H
34 atoms
Cl 3.344073 0.829026 1.212016
Cl -5.437695 -0.493769 -0.936691
O  0.33806 0.535006 2.045185
N  2.337245 -2.648281 -0.844741
N  1.513405 -3.333981 1.255607
C  0.343466 0.196441 0.680377
C  -1.120752 0.010444 0.285224
C  1.006237 1.320396 -0.132266
C  1.048171 -1.137855 0.465908
C  -1.457235 -0.626802 -0.906822
C  -2.146447 0.490313 1.091128
C  2.345534 1.67269 0.05949
C  0.294781 2.074934 -1.061613
C  1.772371 -1.460449 -0.67153
C  0.94768 -2.146622 1.415445
C  -2.777461 -0.77947 -1.293779
C  -3.475746 0.333758 0.722263
C  2.950945 2.700012 -0.644437
C  0.882824 3.109261 -1.774784
C  -3.782231 -0.298689 -0.469054
C  2.214973 3.421827 -1.570328
C  2.183293 -3.527238 0.130394
H  -0.691211 -1.012519 -1.566985
H  -1.933337 0.9973 2.020663
H  -0.747904 1.857965 -1.242836
H  1.242939 0.574296 2.376469
H  1.908335 -0.744615 -1.476062
H  0.394183 -1.995548 2.335316
H  -3.013304 -1.273549 -2.226346
H  -4.259657 0.708033 1.366593
H  3.990857 2.938528 -0.467349
H  0.292031 3.667211 -2.488592
H  2.687154 4.223896 -2.121453
H  2.64498 -4.498057 -0.005135
elementType: Cl O N C H
totalener: -1760.24492971 hartree
nucrepener: 2001.60815588 hartree
electener: -3761.85308559 hartree
oneelecener: -6390.00002101 hartree
twoeener: 2628.14693542 hartree
cpcmener: -0.02081090 hartree
kineticenergy: 1755.34585631 hartree
xcener: -124.323191345187 hartree
chargesum: 0.0000000
charge: -0.089225 -0.095089 -0.387107 -0.346889 -0.349738 0.866311 -0.109916 -0.138714 -0.190086 -0.236354 -0.207528 -0.069551 -0.084104 0.047620 -0.007001 -0.142771 -0.152027 -0.139644 -0.170923 0.109969 -0.136692 0.180509 0.155572 0.141909 0.155237 0.219979 0.149689 0.134035 0.143718 0.143473 0.140929 0.159298 0.162945 0.142164
qa: -0.0892 -0.0951 -0.3871 -0.3469 -0.3497 0.8663 -0.1099 -0.1387 -0.1901 -0.2364 -0.2075 -0.0696 -0.0841 0.0476 -0.0070 -0.1428 -0.1520 -0.1396 -0.1709 0.1100 -0.1367 0.1805 0.1556 0.1419 0.1552 0.2200 0.1497 0.1340 0.1437 0.1435 0.1409 0.1593 0.1629 0.1422
va: 1.2463 1.2105 2.0161 3.0449 3.0381 3.1293 3.6430 3.5810 3.7185 4.0018 4.0567 3.9494 3.8057 4.0120 4.1304 4.0374 3.9963 4.0022 3.9662 3.8305 3.9159 4.0094 0.9992 1.0358 1.0002 1.0422 1.0040 1.0338 1.0078 1.0076 1.0067 0.9923 0.9870 0.9942
dispcorr: -0.019713754 hartree
energy: -1760.264643460398
dipole: 5.13268 -4.66494 0.46774 4.46440 -2.73227 1.73213 -3.63170 2.98535 -0.64635
magnitude: 1.90705 au
magnitude: 4.84733 debye
