program: Orca
programVersion: 4.2.1
elementType: Cl Cl O N N C C C C C C C C C C C C C C C C C H H H H H H H H H H H H
charge: 0
multiplicity: 1
keywords: wb97x-d3
keywords: def2-TZVPP
keywords: def2/J RIJCOSX GRIDX6 NOFINALGRIDX
keywords: grid4 nofinalgrid
keywords: scfconv7
keywords: smallprint printgap noloewdin
keywords: NOSOSCF
formula: C17H12Cl2N2O
InChI: InChI=1S/C17H12Cl2N2O/c18-14-7-5-12(6-8-14)17(22,13-9-20-11-21-10-13)15-3-1-2-4-16(15)19/h1-11,22H
34 atoms
Cl 3.216321 0.879021 1.488335
Cl -5.49978 -0.395903 -0.922889
O  0.372748 0.251363 2.044492
N  2.390314 -2.530335 -1.133676
N  1.819334 -3.360684 0.998274
C  0.323995 0.081043 0.64729
C  -1.14063 -0.076018 0.219717
C  0.98808 1.265623 -0.061319
C  1.097153 -1.190125 0.348521
C  -2.083301 0.822961 0.719733
C  -1.580261 -1.073087 -0.640772
C  2.271746 1.699202 0.289168
C  0.348843 1.951406 -1.091557
C  1.741784 -1.406125 -0.859937
C  1.169686 -2.234803 1.260398
C  -3.41893 0.735416 0.372056
C  -2.918832 -1.179375 -0.997083
C  2.866007 2.787041 -0.332257
C  0.937363 3.033523 -1.728629
C  -3.829382 -0.273336 -0.487103
C  2.19503 3.46086 -1.339945
C  2.39947 -3.453645 -0.187278
H  -1.791912 1.628329 1.382339
H  -0.893173 -1.79741 -1.055256
H  -0.632651 1.635717 -1.415989
H  0.114747 1.151392 2.274046
H  1.736847 -0.652454 -1.640645
H  0.690712 -2.171924 2.229517
H  -4.130033 1.446887 0.769142
H  -3.237093 -1.9692 -1.663591
H  3.85533 3.104066 -0.031041
H  0.40734 3.538061 -2.525194
H  2.663708 4.309381 -1.820175
H  2.931993 -4.372533 -0.402754
elementType: Cl O N C H
totalener: -1760.24235497 hartree
nucrepener: 1999.62632101 hartree
electener: -3759.86867598 hartree
oneelecener: -6386.15770308 hartree
twoeener: 2626.28902710 hartree
cpcmener: -0.02480056 hartree
kineticenergy: 1755.35269916 hartree
xcener: -124.323010517586 hartree
chargesum: 0.0000000
charge: -0.075681 -0.093523 -0.371235 -0.347670 -0.349265 0.956210 -0.171887 -0.154984 -0.260567 -0.249668 -0.159300 -0.086484 -0.062126 0.050869 0.015346 -0.146551 -0.156281 -0.147537 -0.171625 0.116767 -0.133435 0.180372 0.129440 0.159562 0.153582 0.218412 0.143194 0.131970 0.143377 0.141737 0.135513 0.159085 0.161675 0.140707
qa: -0.0757 -0.0935 -0.3712 -0.3477 -0.3493 0.9562 -0.1719 -0.1550 -0.2606 -0.2497 -0.1593 -0.0865 -0.0621 0.0509 0.0153 -0.1466 -0.1563 -0.1475 -0.1716 0.1168 -0.1334 0.1804 0.1294 0.1596 0.1536 0.2184 0.1432 0.1320 0.1434 0.1417 0.1355 0.1591 0.1617 0.1407
va: 1.2457 1.2122 2.0374 3.0435 3.0334 3.0658 3.7673 3.6459 3.7288 4.0875 3.9442 3.9980 3.7420 4.0278 4.1300 4.0040 4.0400 4.0074 3.9606 3.8196 3.9093 4.0134 1.0144 0.9938 1.0009 1.0220 1.0108 1.0358 1.0070 1.0088 1.0119 0.9923 0.9873 0.9949
dispcorr: -0.019934173 hartree
energy: -1760.262289140349
dipole: 4.64798 -5.14732 -0.49935 4.70780 -2.47523 2.23257 -4.39988 3.83193 -0.56795
magnitude: 2.35717 au
magnitude: 5.99146 debye
