program: Orca
programVersion: 4.2.1
elementType: Cl Cl O N N C C C C C C C C C C C C C C C C C H H H H H H H H H H H H
charge: 0
multiplicity: 1
keywords: wb97x-d3
keywords: def2-TZVPP
keywords: def2/J RIJCOSX GRIDX6 NOFINALGRIDX
keywords: grid4 nofinalgrid
keywords: scfconv7
keywords: smallprint printgap noloewdin
keywords: NOSOSCF
formula: C17H12Cl2N2O
InChI: InChI=1S/C17H12Cl2N2O/c18-14-7-5-12(6-8-14)17(22,13-9-20-11-21-10-13)15-3-1-2-4-16(15)19/h1-11,22H
34 atoms
Cl -0.252812 2.769938 1.08193
Cl -5.066057 -0.52384 -0.566646
O  0.970933 0.092026 2.032497
N  1.748935 -3.169586 -1.384414
N  2.34596 -3.568406 0.860132
C  0.834991 -0.104171 0.649786
C  -0.660526 -0.165535 0.345336
C  1.53018 1.046306 -0.082631
C  1.38562 -1.475053 0.253443
C  -1.160072 0.202371 -0.897656
C  -1.543043 -0.663583 1.297856
C  1.099425 2.369192 0.077013
C  2.668124 0.8466 -0.859923
C  1.320163 -1.96466 -1.048093
C  1.917858 -2.352226 1.185126
C  -2.51095 0.091194 -1.189183
C  -2.896657 -0.775983 1.022828
C  1.740679 3.424369 -0.552277
C  3.326764 1.895265 -1.485386
C  -3.372524 -0.393869 -0.220782
C  2.855519 3.187744 -1.340973
C  2.243063 -3.917375 -0.407707
H  -0.506693 0.604182 -1.661899
H  -1.19455 -0.971674 2.273546
H  3.071625 -0.148326 -0.983143
H  1.894281 0.282302 2.237761
H  0.910471 -1.365553 -1.854417
H  1.99906 -2.084917 2.23111
H  -2.879208 0.391398 -2.160412
H  -3.569518 -1.158143 1.778304
H  1.373792 4.432987 -0.41927
H  4.207097 1.69275 -2.079997
H  3.351547 4.016576 -1.827858
H  2.592028 -4.907009 -0.677441
elementType: Cl O N C H
totalener: -1760.24307140 hartree
nucrepener: 2009.55091234 hartree
electener: -3769.79398374 hartree
oneelecener: -6406.15084675 hartree
twoeener: 2636.35686301 hartree
cpcmener: -0.02544066 hartree
kineticenergy: 1755.34519180 hartree
xcener: -124.322783612752 hartree
chargesum: 0.0000000
charge: -0.074756 -0.099688 -0.359249 -0.348390 -0.356438 0.878055 -0.008950 -0.200453 -0.248957 -0.177495 -0.239476 -0.066858 -0.047650 -0.015180 0.039236 -0.172186 -0.166298 -0.155215 -0.178584 0.113011 -0.129979 0.184666 0.154796 0.140683 0.165310 0.217616 0.142609 0.124851 0.143648 0.142464 0.136678 0.159375 0.161999 0.140806
qa: -0.0748 -0.0997 -0.3592 -0.3484 -0.3564 0.8781 -0.0090 -0.2005 -0.2490 -0.1775 -0.2395 -0.0669 -0.0476 -0.0152 0.0392 -0.1722 -0.1663 -0.1552 -0.1786 0.1130 -0.1300 0.1847 0.1548 0.1407 0.1653 0.2176 0.1426 0.1249 0.1436 0.1425 0.1367 0.1594 0.1620 0.1408
va: 1.2444 1.2052 2.0731 3.0595 3.0377 3.2129 3.3825 3.6180 3.7705 3.9263 4.0945 4.0115 3.7509 4.1006 4.0665 4.0824 4.0170 4.0158 3.9606 3.8176 3.9051 4.0075 0.9901 1.0249 0.9906 1.0132 1.0126 1.0409 1.0061 1.0070 1.0117 0.9930 0.9875 0.9950
dispcorr: -0.019857136 hartree
energy: -1760.262928532065
dipole: 17.70176 -15.97981 1.72196 -2.38025 3.65576 1.27551 -3.64495 3.27677 -0.36818
magnitude: 2.17431 au
magnitude: 5.52665 debye
