program: Orca
programVersion: 4.2.1
elementType: Cl F O N N C C C C C C C C C C C C C C C C C H H H H H H H H H H H H
charge: 0
multiplicity: 1
keywords: wb97x-d3
keywords: def2-TZVPP
keywords: def2/J RIJCOSX GRIDX6 NOFINALGRIDX
keywords: grid4 nofinalgrid
keywords: scfconv7
keywords: smallprint printgap noloewdin
keywords: NOSOSCF
formula: C17H12ClFN2O
InChI: InChI=1S/C17H12ClFN2O/c18-16-4-2-1-3-15(16)17(22,13-9-20-11-21-10-13)12-5-7-14(19)8-6-12/h1-11,22H
34 atoms
Cl -0.496854 0.429778 -2.236474
F  5.183429 -0.728396 -0.273546
O  -0.318071 0.0194 2.311021
N  -1.783206 -3.427603 0.534048
N  -3.329849 -1.880461 -0.345059
C  -0.284939 0.0005 0.899826
C  1.182831 -0.24698 0.54818
C  -0.668575 1.374854 0.328927
C  -1.22895 -1.110026 0.468265
C  2.146988 0.509483 1.215025
C  1.60702 -1.163152 -0.405983
C  -0.75209 1.656725 -1.036741
C  -0.885897 2.440026 1.201082
C  -0.947601 -2.433609 0.792484
C  -2.479578 -0.89385 -0.089222
C  3.495884 0.353988 0.945847
C  2.95588 -1.333338 -0.689899
C  -1.049308 2.926868 -1.508025
C  -1.179944 3.715701 0.744796
C  3.878081 -0.571063 -0.006579
C  -1.263779 3.962706 -0.614724
C  -2.933839 -3.101849 -0.034877
H  1.856206 1.24127 1.956897
H  0.897925 -1.767537 -0.953331
H  -0.813149 2.280181 2.267224
H  -1.23484 0.077204 2.6078
H  -0.018109 -2.703778 1.282195
H  -2.828403 0.105211 -0.325241
H  4.235814 0.944566 1.469892
H  3.274639 -2.051369 -1.433903
H  -1.109416 3.104165 -2.573367
H  -1.339932 4.513305 1.457872
H  -1.492605 4.952476 -0.986473
H  -3.618119 -3.912236 -0.256677
elementType: Cl F O N C H
totalener: -1399.88764244 hartree
nucrepener: 1910.33141638 hartree
electener: -3310.21905883 hartree
oneelecener: -5711.78730012 hartree
twoeener: 2401.56824130 hartree
cpcmener: -0.02486948 hartree
kineticenergy: 1395.37001195 hartree
xcener: -110.800920133957 hartree
chargesum: 0.0000000
charge: -0.082809 -0.222472 -0.362847 -0.350346 -0.351533 0.737523 0.034683 -0.042871 -0.183374 -0.227658 -0.186790 -0.086389 -0.153635 -0.031304 0.054190 -0.219359 -0.207625 -0.124249 -0.170364 0.292542 -0.152987 0.184252 0.143424 0.158513 0.141893 0.215065 0.143151 0.147114 0.151319 0.150493 0.139427 0.159221 0.161937 0.141866
qa: -0.0828 -0.2225 -0.3628 -0.3503 -0.3515 0.7375 0.0347 -0.0429 -0.1834 -0.2277 -0.1868 -0.0864 -0.1536 -0.0313 0.0542 -0.2194 -0.2076 -0.1242 -0.1704 0.2925 -0.1530 0.1843 0.1434 0.1585 0.1419 0.2151 0.1432 0.1471 0.1513 0.1505 0.1394 0.1592 0.1619 0.1419
va: 1.2426 1.0569 2.0597 3.0413 3.0446 3.3600 3.4178 3.3780 3.7486 4.0246 3.8623 3.9506 3.8957 4.1455 4.0357 3.9187 3.9726 3.9824 3.9529 3.9281 3.9375 4.0075 1.0152 1.0006 1.0340 1.0148 1.0166 1.0076 0.9989 0.9989 1.0085 0.9924 0.9880 0.9943
dispcorr: -0.019486730 hartree
energy: -1399.907129174321
dipole: -6.82666 6.25237 -0.57429 6.22386 -4.48297 1.74089 7.73017 -7.17763 0.55255
magnitude: 1.91463 au
magnitude: 4.86661 debye
