program: Orca
programVersion: 4.2.1
elementType: Cl O N N C C C C C C C C C C C C C C C C H H H H H H H H H H H H H H H H H
charge: 0
multiplicity: 1
keywords: wb97x-d3
keywords: def2-TZVPP
keywords: def2/J RIJCOSX GRIDX6 NOFINALGRIDX
keywords: grid4 nofinalgrid
keywords: scfconv7
keywords: smallprint printgap noloewdin
keywords: NOSOSCF
formula: C16H17ClN2O
InChI: InChI=1S/C16H17ClN2O/c1-16(13-4-3-9-18-11-13)10-15(20-19(16)2)12-5-7-14(17)8-6-12/h3-9,11,15H,10H2,1-2H3
37 atoms
Cl -4.663644 -0.356741 0.013589
O  1.857108 -1.335486 -1.126066
N  2.89032 -0.419091 -0.792493
N  0.323391 2.738496 -1.257933
C  2.45862 0.139395 0.495542
C  1.892158 -1.097452 1.201888
C  1.185283 -1.801805 0.04835
C  1.369209 1.174029 0.239103
C  3.595557 0.796156 1.266329
C  -0.290225 -1.475544 -0.025504
C  4.145974 -1.149171 -0.766871
C  0.438025 1.503121 1.217541
C  1.266819 1.84599 -0.97313
C  -0.856232 -0.792526 -1.094558
C  -1.110635 -1.842921 1.037514
C  -0.558205 2.419535 0.932488
C  -2.199502 -0.446362 -1.08892
C  -2.454746 -1.508411 1.058416
C  -0.581583 3.000626 -0.323612
C  -2.986761 -0.80051 -0.007563
H  2.707375 -1.70753 1.593748
H  1.232865 -0.878555 2.038104
H  1.307836 -2.887579 0.119715
H  4.363174 0.080364 1.559332
H  3.201078 1.242355 2.178999
H  4.062995 1.593044 0.686945
H  4.963434 -0.443128 -0.632108
H  4.291962 -1.620102 -1.737641
H  4.224016 -1.923313 0.004366
H  0.466097 1.039282 2.19523
H  1.978926 1.644979 -1.762152
H  -0.251528 -0.499128 -1.940383
H  -0.698883 -2.388299 1.878731
H  -1.306996 2.676287 1.668814
H  -2.620543 0.100078 -1.921798
H  -3.074383 -1.792646 1.898119
H  -1.353446 3.716607 -0.581136
elementType: Cl O N C H
totalener: -1264.88281793 hartree
nucrepener: 1731.06654638 hartree
electener: -2995.94936430 hartree
oneelecener: -5167.88767838 hartree
twoeener: 2171.93831407 hartree
cpcmener: -0.02754700 hartree
kineticenergy: 1260.67424072 hartree
xcener: -100.560637654424 hartree
chargesum: -0.0000000
charge: -0.109387 -0.373640 -0.067213 -0.358427 0.396651 -0.270084 0.281046 -0.068432 -0.281425 0.013509 -0.214400 -0.168094 -0.070457 -0.182464 -0.268128 -0.161369 -0.172729 -0.145151 -0.000790 0.108558 0.099115 0.109786 0.129502 0.103485 0.109970 0.113760 0.108192 0.113723 0.095743 0.143258 0.119903 0.144912 0.141415 0.151514 0.137772 0.145053 0.145321
qa: -0.1094 -0.3736 -0.0672 -0.3584 0.3967 -0.2701 0.2810 -0.0684 -0.2814 0.0135 -0.2144 -0.1681 -0.0705 -0.1825 -0.2681 -0.1614 -0.1727 -0.1452 -0.0008 0.1086 0.0991 0.1098 0.1295 0.1035 0.1100 0.1138 0.1082 0.1137 0.0957 0.1433 0.1199 0.1449 0.1414 0.1515 0.1378 0.1451 0.1453
va: 1.1962 1.9181 2.8271 3.0734 3.7949 3.9640 3.8470 3.6449 3.8667 3.5469 3.9750 3.9875 4.0860 3.9449 4.0170 3.9022 3.9954 3.9713 3.9973 3.7918 1.0163 1.0155 0.9852 0.9988 1.0025 1.0034 0.9959 1.0017 0.9925 1.0079 1.0582 1.0217 1.0040 0.9941 1.0094 1.0040 1.0000
dispcorr: -0.022466784 hartree
energy: -1264.905284712028
dipole: 28.50374 -26.93477 1.56897 -1.24516 0.20040 -1.04476 6.76839 -4.16339 2.60500
magnitude: 3.21546 au
magnitude: 8.17306 debye
