program: Orca
programVersion: 4.2.1
elementType: Cl O N N C C C C C C C C C C C C C C C C H H H H H H H H H H H H H H H H H
charge: 0
multiplicity: 1
keywords: wb97x-d3
keywords: def2-TZVPP
keywords: def2/J RIJCOSX GRIDX6 NOFINALGRIDX
keywords: grid4 nofinalgrid
keywords: scfconv7
keywords: smallprint printgap noloewdin
keywords: NOSOSCF
formula: C16H17ClN2O
InChI: InChI=1S/C16H17ClN2O/c1-16(13-4-3-9-18-11-13)10-15(20-19(16)2)12-5-7-14(17)8-6-12/h3-9,11,15H,10H2,1-2H3
37 atoms
Cl -4.689637 -0.435793 -0.031916
O  1.846811 -1.352689 -1.112154
N  2.892882 -0.443703 -0.804968
N  -0.484065 2.448989 1.018785
C  2.470299 0.152647 0.467905
C  1.897841 -1.060323 1.209847
C  1.182365 -1.790499 0.078721
C  1.385777 1.185633 0.183111
C  3.614306 0.82353 1.21551
C  -0.293804 -1.469226 0.001366
C  4.139345 -1.189665 -0.761493
C  1.245166 1.803008 -1.05185
C  0.495427 1.569869 1.181163
C  -0.87072 -0.858697 -1.105038
C  -1.108628 -1.781888 1.086219
C  0.224208 2.721422 -1.239705
C  -2.221122 -0.540675 -1.121752
C  -2.458617 -1.471369 1.086742
C  -0.621563 3.000811 -0.181698
C  -3.00393 -0.845165 -0.022717
H  2.710383 -1.665253 1.61497
H  1.243631 -0.814531 2.042442
H  1.305319 -2.874291 0.175457
H  4.086381 1.598184 0.610558
H  4.377068 0.110675 1.528273
H  3.226731 1.300434 2.115428
H  4.205318 -1.947435 0.026928
H  4.966272 -0.492027 -0.639875
H  4.280879 -1.683267 -1.721438
H  1.912176 1.560025 -1.86657
H  0.573821 1.145883 2.176063
H  -0.273558 -0.604096 -1.968213
H  -0.6896 -2.26797 1.959451
H  0.082616 3.2087 -2.194665
H  -2.650072 -0.055071 -1.987596
H  -3.071796 -1.713637 1.943832
H  -1.436483 3.70484 -0.303442
elementType: Cl O N C H
totalener: -1264.88300858 hartree
nucrepener: 1727.51020303 hartree
electener: -2992.39321161 hartree
oneelecener: -5160.99138330 hartree
twoeener: 2168.59817169 hartree
cpcmener: -0.02610450 hartree
kineticenergy: 1260.67612452 hartree
xcener: -100.560693144848 hartree
chargesum: 0.0000000
charge: -0.109613 -0.371723 -0.065582 -0.350076 0.399297 -0.272888 0.279220 -0.047030 -0.284884 0.028156 -0.213700 -0.205193 -0.076235 -0.199443 -0.268727 -0.142233 -0.164442 -0.146895 -0.008700 0.104656 0.099409 0.110478 0.129019 0.114377 0.104016 0.109690 0.095823 0.107348 0.113564 0.139863 0.120981 0.145277 0.140367 0.156619 0.139222 0.145051 0.144934
qa: -0.1096 -0.3717 -0.0656 -0.3501 0.3993 -0.2729 0.2792 -0.0470 -0.2849 0.0282 -0.2137 -0.2052 -0.0762 -0.1994 -0.2687 -0.1422 -0.1644 -0.1469 -0.0087 0.1047 0.0994 0.1105 0.1290 0.1144 0.1040 0.1097 0.0958 0.1073 0.1136 0.1399 0.1210 0.1453 0.1404 0.1566 0.1392 0.1451 0.1449
va: 1.1966 1.9170 2.8336 3.0702 3.7789 3.9665 3.8459 3.5800 3.8704 3.5410 3.9760 3.9715 4.1246 3.9640 4.0197 3.8901 3.9843 3.9715 4.0016 3.8057 1.0166 1.0154 0.9849 1.0034 0.9983 1.0019 0.9927 0.9965 1.0015 1.0424 1.0236 1.0203 1.0043 0.9920 1.0083 1.0039 0.9995
dispcorr: -0.022185142 hartree
energy: -1264.905193721425
dipole: 29.89835 -27.57225 2.32610 -0.44035 -0.28912 -0.72947 3.32526 -2.79126 0.53400
magnitude: 2.49560 au
magnitude: 6.34331 debye
