program: Orca
programVersion: 4.2.1
elementType: Cl O N N C C C C C C C C C C C C C C C C H H H H H H H H H H H H H H H H H
charge: 0
multiplicity: 1
keywords: wb97x-d3
keywords: def2-TZVPP
keywords: def2/J RIJCOSX GRIDX6 NOFINALGRIDX
keywords: grid4 nofinalgrid
keywords: scfconv7
keywords: smallprint printgap noloewdin
keywords: NOSOSCF
formula: C16H17ClN2O
InChI: InChI=1S/C16H17ClN2O/c1-16(13-4-3-9-18-11-13)10-15(20-19(16)2)12-5-7-14(17)8-6-12/h3-9,11,15H,10H2,1-2H3
37 atoms
Cl -5.067692 -2.105573 -0.332846
O  1.656932 -1.571538 -0.515899
N  1.852551 -0.205484 -0.882315
N  0.44006 3.642545 -0.5998
C  2.193375 0.456597 0.392341
C  1.158348 -0.200636 1.327478
C  0.847232 -1.546822 0.641067
C  1.925635 1.939634 0.228978
C  3.60964 0.160122 0.884396
C  -0.622283 -1.711446 0.343853
C  2.875578 -0.1884 -1.90067
C  2.758833 2.924394 0.740989
C  0.774715 2.371314 -0.431523
C  -1.196827 -1.28909 -0.850585
C  -1.443825 -2.270047 1.317643
C  2.417089 4.25984 0.57836
C  -2.562272 -1.410801 -1.06358
C  -2.810743 -2.395366 1.122482
C  1.253038 4.568697 -0.098983
C  -3.359625 -1.959876 -0.07248
H  1.562709 -0.33833 2.329096
H  0.259387 0.40737 1.420016
H  1.174381 -2.383932 1.262321
H  3.790838 -0.914323 0.913586
H  3.750699 0.533349 1.897951
H  4.376189 0.613081 0.254894
H  3.80322 -0.697106 -1.619506
H  3.10695 0.850267 -2.13396
H  2.492574 -0.648911 -2.810979
H  3.669146 2.672214 1.267102
H  0.088839 1.642718 -0.846794
H  -0.590624 -0.846999 -1.628493
H  -1.015522 -2.61726 2.25031
H  3.046607 5.046111 0.971057
H  -2.995982 -1.076486 -1.996102
H  -3.43261 -2.832387 1.89147
H  0.960777 5.601521 -0.245357
elementType: Cl O N C H
totalener: -1264.88261442 hartree
nucrepener: 1637.89050474 hartree
electener: -2902.77311916 hartree
oneelecener: -4981.47118483 hartree
twoeener: 2078.69806567 hartree
cpcmener: -0.02512487 hartree
kineticenergy: 1260.66247778 hartree
xcener: -100.550875762939 hartree
chargesum: 0.0000000
charge: -0.105467 -0.354820 -0.101722 -0.373159 0.528682 -0.204594 0.289582 -0.218367 -0.378675 -0.018400 -0.209998 -0.140751 -0.036323 -0.225452 -0.240904 -0.158901 -0.164896 -0.141246 0.010477 0.098698 0.095846 0.112222 0.120136 0.111592 0.106600 0.113913 0.095638 0.113765 0.113332 0.148977 0.123774 0.154117 0.141478 0.158544 0.144428 0.145059 0.146814
qa: -0.1055 -0.3548 -0.1017 -0.3732 0.5287 -0.2046 0.2896 -0.2184 -0.3787 -0.0184 -0.2100 -0.1408 -0.0363 -0.2255 -0.2409 -0.1589 -0.1649 -0.1412 0.0105 0.0987 0.0958 0.1122 0.1201 0.1116 0.1066 0.1139 0.0956 0.1138 0.1133 0.1490 0.1238 0.1541 0.1415 0.1585 0.1444 0.1451 0.1468
va: 1.1997 1.8839 2.6951 3.0757 3.4209 3.9620 3.7697 3.7120 3.9619 3.5857 3.9604 3.9433 4.0754 3.9593 4.0511 3.9212 4.0342 3.9676 3.9845 3.8089 1.0162 0.9924 0.9983 1.0124 1.0007 0.9907 0.9996 0.9908 0.9949 1.0033 1.0376 1.0181 1.0061 0.9934 1.0071 1.0048 0.9977
dispcorr: -0.019123153 hartree
energy: -1264.901737572266
dipole: 29.54695 -27.09009 2.45686 7.62728 -7.40677 0.22051 3.39397 -1.86649 1.52748
magnitude: 2.90138 au
magnitude: 7.37472 debye
