program: Orca
programVersion: 4.2.1
elementType: Cl O N N C C C C C C C C C C C C C C C C H H H H H H H H H H H H H H H H H
charge: 0
multiplicity: 1
keywords: wb97x-d3
keywords: def2-TZVPP
keywords: def2/J RIJCOSX GRIDX6 NOFINALGRIDX
keywords: grid4 nofinalgrid
keywords: scfconv7
keywords: smallprint printgap noloewdin
keywords: NOSOSCF
formula: C16H17ClN2O
InChI: InChI=1S/C16H17ClN2O/c1-16(13-4-3-9-18-11-13)10-15(20-19(16)2)12-5-7-14(17)8-6-12/h3-9,11,15H,10H2,1-2H3
37 atoms
Cl -4.73326 -0.485334 -0.022458
O  1.823397 -1.286186 -1.10951
N  2.897377 -0.426401 -0.768758
N  0.437085 2.81274 -1.306645
C  2.471385 0.168278 0.50389
C  1.840834 -1.031748 1.222149
C  1.153981 -1.755931 0.06537
C  1.433226 1.247247 0.222593
C  3.625287 0.786629 1.282163
C  -0.324728 -1.459021 -0.024025
C  4.113877 -1.219487 -0.708812
C  0.557932 1.674532 1.214408
C  1.330432 1.872334 -1.014625
C  -0.882708 -0.700013 -1.044804
C  -1.161215 -1.941832 0.978826
C  -0.383542 2.645778 0.924049
C  -2.236453 -0.395884 -1.049009
C  -2.515899 -1.652557 0.987708
C  -0.412605 3.176039 -0.354277
C  -3.04169 -0.869819 -0.028437
H  2.619935 -1.652818 1.666058
H  1.15502 -0.765389 2.022827
H  1.29343 -2.838801 0.151406
H  4.358785 0.043359 1.593121
H  3.23982 1.259468 2.18518
H  4.132153 1.556318 0.699233
H  4.964463 -0.554325 -0.571919
H  4.250237 -1.716219 -1.667805
H  4.138344 -1.981135 0.078062
H  0.594124 1.253021 2.21117
H  1.998507 1.591729 -1.8176
H  -0.267944 -0.324423 -1.849336
H  -0.754238 -2.550515 1.777867
H  -1.084541 2.985301 1.673802
H  -2.651483 0.20786 -1.844434
H  -3.148835 -2.032161 1.778131
H  -1.142247 3.933542 -0.615721
elementType: Cl O N C H
totalener: -1264.88372776 hartree
nucrepener: 1718.44414722 hartree
electener: -2983.32787498 hartree
oneelecener: -5142.66216131 hartree
twoeener: 2159.33428633 hartree
cpcmener: -0.02745691 hartree
kineticenergy: 1260.67284712 hartree
xcener: -100.559435077547 hartree
chargesum: 0.0000000
charge: -0.108194 -0.370503 -0.061885 -0.359233 0.398589 -0.264661 0.276397 -0.069306 -0.284482 0.018378 -0.214791 -0.175802 -0.078377 -0.201315 -0.274062 -0.163359 -0.162702 -0.140829 -0.001977 0.096763 0.100067 0.110552 0.129820 0.103628 0.110170 0.115089 0.107747 0.113904 0.097096 0.144114 0.123820 0.153020 0.144572 0.154987 0.139947 0.146263 0.146558
qa: -0.1082 -0.3705 -0.0619 -0.3592 0.3986 -0.2647 0.2764 -0.0693 -0.2845 0.0184 -0.2148 -0.1758 -0.0784 -0.2013 -0.2741 -0.1634 -0.1627 -0.1408 -0.0020 0.0968 0.1001 0.1106 0.1298 0.1036 0.1102 0.1151 0.1077 0.1139 0.0971 0.1441 0.1238 0.1530 0.1446 0.1550 0.1399 0.1463 0.1466
va: 1.1973 1.9162 2.8359 3.0668 3.8073 3.9451 3.8265 3.6209 3.8693 3.5475 3.9764 3.9882 4.0775 3.9686 4.0296 3.9107 4.0012 3.9665 3.9988 3.8079 1.0158 1.0148 0.9875 0.9986 1.0024 1.0031 0.9960 1.0022 0.9912 1.0066 1.0556 1.0169 1.0036 0.9924 1.0087 1.0035 0.9993
dispcorr: -0.021818656 hartree
energy: -1264.905546417961
dipole: 28.68802 -27.11373 1.57429 -0.87123 -0.12742 -0.99865 7.10815 -4.46455 2.64360
magnitude: 3.23486 au
magnitude: 8.22236 debye
